null
SMILES: N[C@H]1CC[C@@](CCOc2cc(F)c(cc2F)S(=O)(=O)Nc2ncns2)(CC1)c1ccc(Cl)cc1
InChI Key: InChIKey=USIAWHSRJOGWQW-CIEDQVTBSA-N
Activity Spreadsheet -- Enzyme Inhibition Constant Data from BindingDB
Found 3 hits for monomerid = 50237491
Trg + Lig
Ki
nM
ΔG°
kcal/mole
IC50
nM
Kd
nM
EC50/IC50
nM
koff
s-1
kon
M-1s-1
pHTemp
°C
Sodium channel protein type 9 subunit alpha
(Homo sapiens (Human))
BDBM50237491
(CHEMBL4094887)
Show SMILES N[C@H]1CC[C@@](CCOc2cc(F)c(cc2F)S(=O)(=O)Nc2ncns2)(CC1)c1ccc(Cl)cc1 |r,wU:4.4,1.0,(66.64,-7.74,;66.69,-6.2,;65.39,-5.39,;65.44,-3.85,;66.79,-3.14,;67.56,-1.81,;69.1,-1.82,;69.86,-3.15,;71.4,-3.16,;72.17,-1.84,;73.7,-1.84,;74.47,-.51,;74.47,-3.18,;73.69,-4.51,;72.16,-4.5,;71.38,-5.83,;76.01,-3.18,;76.42,-1.69,;77.5,-2.8,;76.77,-4.52,;78.31,-4.53,;79.22,-3.29,;80.68,-3.77,;80.67,-5.31,;79.21,-5.78,;68.1,-3.93,;68.05,-5.47,;65.69,-2.04,;66.1,-.53,;65,.58,;63.49,.17,;62.41,1.26,;63.09,-1.34,;64.19,-2.44,)|
Show InChI InChI=1S/C22H23ClF2N4O3S2/c23-15-3-1-14(2-4-15)22(7-5-16(26)6-8-22)9-10-32-19-11-18(25)20(12-17(19)24)34(30,31)29-21-27-13-28-33-21/h1-4,11-13,16H,5-10,26H2,(H,27,28,29)/t16-,22-
n/an/a 8n/an/an/an/an/an/a
Bristol-Myers Squibb
Curated by ChEMBL
Assay Description
Inhibition of recombinant human Nav1.7 expressed in HEK293 cells assessed as reduction in peak inward current at -60 mV holding potential measured af...
J Med Chem 60: 2513-2525 (2017)
Article DOI: 10.1021/acs.jmedchem.6b01918
BindingDB Entry DOI: 10.7270/Q2057J69
Sodium channel protein type 5 subunit alpha
(Homo sapiens (Human))
BDBM50237491
(CHEMBL4094887)
Show SMILES N[C@H]1CC[C@@](CCOc2cc(F)c(cc2F)S(=O)(=O)Nc2ncns2)(CC1)c1ccc(Cl)cc1 |r,wU:4.4,1.0,(66.64,-7.74,;66.69,-6.2,;65.39,-5.39,;65.44,-3.85,;66.79,-3.14,;67.56,-1.81,;69.1,-1.82,;69.86,-3.15,;71.4,-3.16,;72.17,-1.84,;73.7,-1.84,;74.47,-.51,;74.47,-3.18,;73.69,-4.51,;72.16,-4.5,;71.38,-5.83,;76.01,-3.18,;76.42,-1.69,;77.5,-2.8,;76.77,-4.52,;78.31,-4.53,;79.22,-3.29,;80.68,-3.77,;80.67,-5.31,;79.21,-5.78,;68.1,-3.93,;68.05,-5.47,;65.69,-2.04,;66.1,-.53,;65,.58,;63.49,.17,;62.41,1.26,;63.09,-1.34,;64.19,-2.44,)|
Show InChI InChI=1S/C22H23ClF2N4O3S2/c23-15-3-1-14(2-4-15)22(7-5-16(26)6-8-22)9-10-32-19-11-18(25)20(12-17(19)24)34(30,31)29-21-27-13-28-33-21/h1-4,11-13,16H,5-10,26H2,(H,27,28,29)/t16-,22-
n/an/a>3.00E+4n/an/an/an/an/an/a
Bristol-Myers Squibb
Curated by ChEMBL
Assay Description
Inhibition of recombinant human Nav1.5 expressed in HEK293 cells assessed as reduction in peak inward current at -50 mV holding potential measured af...
J Med Chem 60: 2513-2525 (2017)
Article DOI: 10.1021/acs.jmedchem.6b01918
BindingDB Entry DOI: 10.7270/Q2057J69
Cytochrome P450 3A4
(Homo sapiens (Human))
BDBM50237491
(CHEMBL4094887)
Show SMILES N[C@H]1CC[C@@](CCOc2cc(F)c(cc2F)S(=O)(=O)Nc2ncns2)(CC1)c1ccc(Cl)cc1 |r,wU:4.4,1.0,(66.64,-7.74,;66.69,-6.2,;65.39,-5.39,;65.44,-3.85,;66.79,-3.14,;67.56,-1.81,;69.1,-1.82,;69.86,-3.15,;71.4,-3.16,;72.17,-1.84,;73.7,-1.84,;74.47,-.51,;74.47,-3.18,;73.69,-4.51,;72.16,-4.5,;71.38,-5.83,;76.01,-3.18,;76.42,-1.69,;77.5,-2.8,;76.77,-4.52,;78.31,-4.53,;79.22,-3.29,;80.68,-3.77,;80.67,-5.31,;79.21,-5.78,;68.1,-3.93,;68.05,-5.47,;65.69,-2.04,;66.1,-.53,;65,.58,;63.49,.17,;62.41,1.26,;63.09,-1.34,;64.19,-2.44,)|
Show InChI InChI=1S/C22H23ClF2N4O3S2/c23-15-3-1-14(2-4-15)22(7-5-16(26)6-8-22)9-10-32-19-11-18(25)20(12-17(19)24)34(30,31)29-21-27-13-28-33-21/h1-4,11-13,16H,5-10,26H2,(H,27,28,29)/t16-,22-
Reactome pathway
n/an/a 280n/an/an/an/an/an/a
Bristol-Myers Squibb
Curated by ChEMBL
Assay Description
Inhibition of human CYP3A4 assessed as inhibition of dealkylation
J Med Chem 60: 2513-2525 (2017)
Article DOI: 10.1021/acs.jmedchem.6b01918
BindingDB Entry DOI: 10.7270/Q2057J69