BDBM50237537 CHEMBL4093601
SMILES: C[C@@]1(F)[C@H](O)[C@@H](COP(O)(=O)OP(O)(=O)OP(O)(O)=O)O[C@H]1c1cnc2c(N)ncnn12
InChI Key: InChIKey=YEHQEJXGZWWIFK-HGIWHZBTSA-N
Data: 1 IC50
Activity Spreadsheet -- Enzyme Inhibition Constant Data from BindingDB
Found 1 hit for monomerid = 50237537
Trg + Lig
Ki
nM
ΔG°
kcal/mole
IC50
nM
Kd
nM
EC50/IC50
nM
koff
s-1
kon
M-1s-1
pHTemp
°C
DNA polymerase beta
(Homo sapiens (Human))
BDBM50237537
(CHEMBL4093601)
Show SMILES C[C@@]1(F)[C@H](O)[C@@H](COP(O)(=O)OP(O)(=O)OP(O)(O)=O)O[C@H]1c1cnc2c(N)ncnn12 |r|
Show InChI InChI=1S/C11H17FN5O12P3/c1-11(12)7(18)6(3-26-31(22,23)29-32(24,25)28-30(19,20)21)27-8(11)5-2-14-10-9(13)15-4-16-17(5)10/h2,4,6-8,18H,3H2,1H3,(H,22,23)(H,24,25)(H2,13,15,16)(H2,19,20,21)/t6-,7-,8+,11-/m1/s1
Reactome pathway
n/an/a>2.00E+5n/an/an/an/an/an/a
Gilead Sciences
Curated by ChEMBL
Assay Description
Inhibition of human DNA polymerase-beta
Bioorg Med Chem Lett 27: 1840-1847 (2017)
Article DOI: 10.1016/j.bmcl.2017.02.037
BindingDB Entry DOI: 10.7270/Q2M047Q1