null
SMILES: [Na+].Cc1cc(Nc2cc(c(N)c3C(=O)c4ccccc4C(=O)c23)S([O-])(=O)=O)ccc1Cl
InChI Key: InChIKey=VIGDYRBYZHSJLY-UHFFFAOYSA-M
Activity Spreadsheet -- Enzyme Inhibition Constant Data from BindingDB
Found 1 hit for monomerid = 50237561
Trg + Lig
Ki
nM
ΔG°
kcal/mole
IC50
nM
Kd
nM
EC50/IC50
nM
koff
s-1
kon
M-1s-1
pHTemp
°C
P2Y purinoceptor 4
(Homo sapiens (Human))
BDBM50237561
(CHEMBL4082692)
Show SMILES [Na+].Cc1cc(Nc2cc(c(N)c3C(=O)c4ccccc4C(=O)c23)S([O-])(=O)=O)ccc1Cl
Show InChI InChI=1S/C21H15ClN2O5S/c1-10-8-11(6-7-14(10)22)24-15-9-16(30(27,28)29)19(23)18-17(15)20(25)12-4-2-3-5-13(12)21(18)26/h2-9,24H,23H2,1H3,(H,27,28,29)/p-1
Reactome pathway
n/an/a 1.65E+3n/an/an/an/an/an/a
University of Bonn
Curated by ChEMBL
Assay Description
Antagonist activity at human P2Y4 receptor transfected in human 1321N1 cells assessed as inhibition of UTP-activated intracellular calcium mobilizati...
J Med Chem 60: 3020-3038 (2017)
Article DOI: 10.1021/acs.jmedchem.7b00030
BindingDB Entry DOI: 10.7270/Q2G73H15