BDBM50237699 CHEMBL4060978
SMILES: COC(=O)C1=C(Nc2cccc(Cl)c2)O\C(=C/c2c[nH]c3ncccc23)C1=O
InChI Key: InChIKey=HFUIXOUZSYYSIA-NVNXTCNLSA-N
Data: 1 IC50
Activity Spreadsheet -- Enzyme Inhibition Constant Data from BindingDB
Found 1 hit for monomerid = 50237699
Trg + Lig
Ki
nM
ΔG°
kcal/mole
IC50
nM
Kd
nM
EC50/IC50
nM
koff
s-1
kon
M-1s-1
pHTemp
°C
CDC7 and DBF4
(Homo sapiens (Human))
BDBM50237699
(CHEMBL4060978)
Show SMILES COC(=O)C1=C(Nc2cccc(Cl)c2)O\C(=C/c2c[nH]c3ncccc23)C1=O |c:4|
Show InChI InChI=1S/C20H14ClN3O4/c1-27-20(26)16-17(25)15(8-11-10-23-18-14(11)6-3-7-22-18)28-19(16)24-13-5-2-4-12(21)9-13/h2-10,24H,1H3,(H,22,23)/b15-8-
n/an/a 12n/an/an/an/an/an/a
Carna Biosciences, Inc.
Curated by ChEMBL
Assay Description
Inhibition of 1 nM AVP-induced cAMP accumulation in cells expressing human vasopressin V2 receptor
Eur J Med Chem 130: 406-418 (2017)
Article DOI: 10.1016/j.ejmech.2017.02.030
BindingDB Entry DOI: 10.7270/Q2X63Q71