BDBM50237720 CHEMBL4092195
SMILES: Fc1ccccc1N\C(NCC12CC3CC(CC(C3)C1)C2)=N\C#N
InChI Key: InChIKey=KUGSXHAANZNCME-UHFFFAOYSA-N
Data: 1 IC50
Activity Spreadsheet -- Enzyme Inhibition Constant Data from BindingDB
Found 1 hit for monomerid = 50237720
Trg + Lig
Ki
nM
ΔG°
kcal/mole
IC50
nM
Kd
nM
EC50/IC50
nM
koff
s-1
kon
M-1s-1
pHTemp
°C
P2X purinoceptor 7
(Homo sapiens (Human))
BDBM50237720
(CHEMBL4092195)
Show SMILES Fc1ccccc1N\C(NCC12CC3CC(CC(C3)C1)C2)=N\C#N |TLB:10:11:14.13.18:16,THB:12:13:16:20.11.19,12:11:14.13.18:16,19:11:14:18.17.16,19:17:14:20.12.11|
Show InChI InChI=1S/C19H23FN4/c20-16-3-1-2-4-17(16)24-18(23-12-21)22-11-19-8-13-5-14(9-19)7-15(6-13)10-19/h1-4,13-15H,5-11H2,(H2,22,23,24)
n/an/a 58n/an/an/an/an/an/a
The University of Sydney
Curated by ChEMBL
Assay Description
Inhibition of [3H]-Ro- 15-1788 binding to recombinant human gamma-aminobutyric-acid A receptor alpha-2-beta-3-gamma-2
Eur J Med Chem 130: 433-439 (2017)
Article DOI: 10.1016/j.ejmech.2017.02.060
BindingDB Entry DOI: 10.7270/Q2SJ1NW5