BDBM50238003 CHEMBL4081365
SMILES: Cc1ccc2cnn(CCC(O)=O)c2c1
InChI Key: InChIKey=BESPFRRPYKKFGB-UHFFFAOYSA-N
Data: 1 IC50
Activity Spreadsheet -- Enzyme Inhibition Constant Data from BindingDB
Found 1 hit for monomerid = 50238003
Trg + Lig
Ki
nM
ΔG°
kcal/mole
IC50
nM
Kd
nM
EC50/IC50
nM
koff
s-1
kon
M-1s-1
pHTemp
°C
Kynurenine 3-monooxygenase
(Homo sapiens (Human))
BDBM50238003
(CHEMBL4081365)
Show SMILES Cc1ccc2cnn(CCC(O)=O)c2c1
Show InChI InChI=1S/C11H12N2O2/c1-8-2-3-9-7-12-13(10(9)6-8)5-4-11(14)15/h2-3,6-7H,4-5H2,1H3,(H,14,15)
Reactome pathway
n/an/a 3.16E+3n/an/an/an/an/an/a
GlaxoSmithKline
Curated by ChEMBL
Assay Description
Inhibition of recombinant full-length human N-terminal GST tagged KMO expressed in baculovirus infected Sf9 insect cell membranes using L-kynurenine ...
Bioorg Med Chem Lett 27: 2023-2028 (2017)
Article DOI: 10.1016/j.bmcl.2017.02.078
BindingDB Entry DOI: 10.7270/Q23R0W54