BDBM50238063 CHEMBL4101751
SMILES: CNC(=O)n1ncc2nccc(Nc3cc(ncc3C)-c3cc(F)ccc3F)c12
InChI Key: InChIKey=GKLQGFLTBRUPTD-UHFFFAOYSA-N
Data: 1 IC50  2 EC50
Activity Spreadsheet -- Enzyme Inhibition Constant Data from BindingDB
Found 3 hits for monomerid = 50238063
Trg + Lig
Ki
nM
ΔG°
kcal/mole
IC50
nM
Kd
nM
EC50/IC50
nM
koff
s-1
kon
M-1s-1
pHTemp
°C
TGF-beta receptor type-1
(Homo sapiens (Human))
BDBM50238063
(CHEMBL4101751)
Show SMILES CNC(=O)n1ncc2nccc(Nc3cc(ncc3C)-c3cc(F)ccc3F)c12
Show InChI InChI=1S/C20H16F2N6O/c1-11-9-25-17(13-7-12(21)3-4-14(13)22)8-16(11)27-15-5-6-24-18-10-26-28(19(15)18)20(29)23-2/h3-10H,1-2H3,(H,23,29)(H,24,25,27)
n/an/a 1n/an/an/an/an/an/a
Takeda California
Curated by ChEMBL
Assay Description
Inhibition of recombinant N-terminal GST tagged human ALK5 (200 to 503 residues) expressed in baculovirus expression system using FAM-NH2-KVLTQMGSPSI...
Bioorg Med Chem Lett 27: 1955-1961 (2017)
Article DOI: 10.1016/j.bmcl.2017.03.026
BindingDB Entry DOI: 10.7270/Q2QJ7KKZ
TGF-beta receptor type-1
(Homo sapiens (Human))
BDBM50238063
(CHEMBL4101751)
Show SMILES CNC(=O)n1ncc2nccc(Nc3cc(ncc3C)-c3cc(F)ccc3F)c12
Show InChI InChI=1S/C20H16F2N6O/c1-11-9-25-17(13-7-12(21)3-4-14(13)22)8-16(11)27-15-5-6-24-18-10-26-28(19(15)18)20(29)23-2/h3-10H,1-2H3,(H,23,29)(H,24,25,27)
n/an/an/an/a 25n/an/an/an/a
Takeda California
Curated by ChEMBL
Assay Description
Inhibition of ALK5 (unknown origin) expressed in SBE-bla HEK293T cells assessed as decrease in TGFbeta1-induced Smad2/3 phosphorylation by beta lacta...
Bioorg Med Chem Lett 27: 1955-1961 (2017)
Article DOI: 10.1016/j.bmcl.2017.03.026
BindingDB Entry DOI: 10.7270/Q2QJ7KKZ
TGF-beta receptor type-1
(Homo sapiens (Human))
BDBM50238063
(CHEMBL4101751)
Show SMILES CNC(=O)n1ncc2nccc(Nc3cc(ncc3C)-c3cc(F)ccc3F)c12
Show InChI InChI=1S/C20H16F2N6O/c1-11-9-25-17(13-7-12(21)3-4-14(13)22)8-16(11)27-15-5-6-24-18-10-26-28(19(15)18)20(29)23-2/h3-10H,1-2H3,(H,23,29)(H,24,25,27)
n/an/an/an/a 20n/an/an/an/a
Takeda California
Curated by ChEMBL
Assay Description
Inhibition of ALK5 in human Calu6 cells assessed as reduction in Smad2/3 phosphorylation
Bioorg Med Chem Lett 27: 1955-1961 (2017)
Article DOI: 10.1016/j.bmcl.2017.03.026
BindingDB Entry DOI: 10.7270/Q2QJ7KKZ