null
SMILES: CN(C)c1ccc(Nc2nc3ccccc3n3nnnc23)cc1
InChI Key: InChIKey=QFDQTVNPCCYMTN-UHFFFAOYSA-N
Activity Spreadsheet -- Enzyme Inhibition Constant Data from BindingDB
Found 2 hits for monomerid = 50238445
Trg + Lig
Ki
nM
ΔG°
kcal/mole
IC50
nM
Kd
nM
EC50/IC50
nM
koff
s-1
kon
M-1s-1
pHTemp
°C
Poly [ADP-ribose] polymerase tankyrase-1
(Homo sapiens (Human))
BDBM50238445
(CHEMBL1516121)
Show SMILES CN(C)c1ccc(Nc2nc3ccccc3n3nnnc23)cc1
Show InChI InChI=1S/C16H15N7/c1-22(2)12-9-7-11(8-10-12)17-15-16-19-20-21-23(16)14-6-4-3-5-13(14)18-15/h3-10H,1-2H3,(H,17,18)
n/an/a 1.26E+3n/an/an/an/an/an/a
A GlaxoSmithKline Company
Curated by ChEMBL
Assay Description
Inhibition of TNKS1 (unknown origin) expressed in HEK293 cells co-expressing TCF/LEF luciferase plasmid assessed as reduction in wnt3a ligand-induced...
J Med Chem 60: 5455-5471 (2017)
Article DOI: 10.1021/acs.jmedchem.7b00137
BindingDB Entry DOI: 10.7270/Q2X350RS
Poly [ADP-ribose] polymerase tankyrase-1
(Homo sapiens (Human))
BDBM50238445
(CHEMBL1516121)
Show SMILES CN(C)c1ccc(Nc2nc3ccccc3n3nnnc23)cc1
Show InChI InChI=1S/C16H15N7/c1-22(2)12-9-7-11(8-10-12)17-15-16-19-20-21-23(16)14-6-4-3-5-13(14)18-15/h3-10H,1-2H3,(H,17,18)
n/an/a 63n/an/an/an/an/an/a
A GlaxoSmithKline Company
Curated by ChEMBL
Assay Description
Binding affinity to TNKS1 in human HeLa cell extract after 2 hrs by HTS assay
J Med Chem 60: 5455-5471 (2017)
Article DOI: 10.1021/acs.jmedchem.7b00137
BindingDB Entry DOI: 10.7270/Q2X350RS