BDBM50242519 (2S,4S)-1-(N-Cyclooctylglycyl)-4-fluoropyrrolidine-2-carbonitrile::CHEMBL470681
SMILES: F[C@H]1C[C@@H](C#N)N(C1)C(=O)CNC1CCCCCCC1
InChI Key: InChIKey=OLOICRNYYAKYRZ-JSGCOSHPSA-N
Data: 1 IC50
Activity Spreadsheet -- Enzyme Inhibition Constant Data from BindingDB
Found 1 hit for monomerid = 50242519
Trg + Lig
Ki
nM
ΔG°
kcal/mole
IC50
nM
Kd
nM
EC50/IC50
nM
koff
s-1
kon
M-1s-1
pHTemp
°C
Dipeptidyl peptidase 4
(Homo sapiens (Human))
BDBM50242519
((2S,4S)-1-(N-Cyclooctylglycyl)-4-fluoropyrrolidine...)
Show SMILES F[C@H]1C[C@@H](C#N)N(C1)C(=O)CNC1CCCCCCC1 |r|
Show InChI InChI=1S/C15H24FN3O/c16-12-8-14(9-17)19(11-12)15(20)10-18-13-6-4-2-1-3-5-7-13/h12-14,18H,1-8,10-11H2/t12-,14-/m0/s1
Reactome pathway
n/an/a 3.30n/an/an/an/an/an/a
Taisho Pharmaceutical Co., Ltd
Curated by ChEMBL
Assay Description
Inhibition of DPP4 in human plasma by fluorescence assay
Bioorg Med Chem 16: 4093-106 (2008)
Article DOI: 10.1016/j.bmc.2008.01.016
BindingDB Entry DOI: 10.7270/Q27H1KGN