BDBM50242934 CHEMBL4066743
SMILES: N[C@@H]1CCCN(C1)C(=O)c1cc(OCC(O)C(F)(F)F)n(n1)-c1ccc(cc1)C#N
InChI Key: InChIKey=KZHLEDUVDQZNAW-JBZHPUCOSA-N
Data: 2 IC50  1 Kd
Activity Spreadsheet -- Enzyme Inhibition Constant Data from BindingDB
Found 3 hits for monomerid = 50242934
Trg + Lig
Ki
nM
ΔG°
kcal/mole
IC50
nM
Kd
nM
EC50/IC50
nM
koff
s-1
kon
M-1s-1
pHTemp
°C
Lysine-specific histone demethylase 1A
(Homo sapiens (Human))
BDBM50242934
(CHEMBL4066743)
Show SMILES N[C@@H]1CCCN(C1)C(=O)c1cc(OCC(O)C(F)(F)F)n(n1)-c1ccc(cc1)C#N |r|
Show InChI InChI=1S/C19H20F3N5O3/c20-19(21,22)16(28)11-30-17-8-15(18(29)26-7-1-2-13(24)10-26)25-27(17)14-5-3-12(9-23)4-6-14/h3-6,8,13,16,28H,1-2,7,10-11,24H2/t13-,16?/m1/s1
Reactome pathway
n/an/a 480n/an/an/an/an/an/a
University of Manchester
Curated by ChEMBL
Assay Description
Inhibition of Fibrinogen receptor binding
Bioorg Med Chem Lett 27: 3190-3195 (2017)
Article DOI: 10.1016/j.bmcl.2017.05.018
BindingDB Entry DOI: 10.7270/Q2M047W8
Lysine-specific histone demethylase 1A
(Homo sapiens (Human))
BDBM50242934
(CHEMBL4066743)
Show SMILES N[C@@H]1CCCN(C1)C(=O)c1cc(OCC(O)C(F)(F)F)n(n1)-c1ccc(cc1)C#N |r|
Show InChI InChI=1S/C19H20F3N5O3/c20-19(21,22)16(28)11-30-17-8-15(18(29)26-7-1-2-13(24)10-26)25-27(17)14-5-3-12(9-23)4-6-14/h3-6,8,13,16,28H,1-2,7,10-11,24H2/t13-,16?/m1/s1
Reactome pathway
n/an/a 50n/an/an/an/an/an/a
University of Manchester
Curated by ChEMBL
Assay Description
Inhibition of platelet aggregation (PRP)
Bioorg Med Chem Lett 27: 3190-3195 (2017)
Article DOI: 10.1016/j.bmcl.2017.05.018
BindingDB Entry DOI: 10.7270/Q2M047W8
Lysine-specific histone demethylase 1A
(Homo sapiens (Human))
BDBM50242934
(CHEMBL4066743)
Show SMILES N[C@@H]1CCCN(C1)C(=O)c1cc(OCC(O)C(F)(F)F)n(n1)-c1ccc(cc1)C#N |r|
Show InChI InChI=1S/C19H20F3N5O3/c20-19(21,22)16(28)11-30-17-8-15(18(29)26-7-1-2-13(24)10-26)25-27(17)14-5-3-12(9-23)4-6-14/h3-6,8,13,16,28H,1-2,7,10-11,24H2/t13-,16?/m1/s1
Reactome pathway
n/an/an/a 6n/an/an/an/an/a
University of Manchester
Curated by ChEMBL
Assay Description
Reversible inhibition of human recombinant N-terminal truncated LSD1 (151 to 852 residues) expressed in Escherichia coli by SPR analysis
Bioorg Med Chem Lett 27: 3190-3195 (2017)
Article DOI: 10.1016/j.bmcl.2017.05.018
BindingDB Entry DOI: 10.7270/Q2M047W8