BDBM50243173 CHEMBL487445::N-(2-Benzoyl-phenyl)-4-[3-(3-piperidin-1-yl-propyl)-ureido]-benzenesulfonamide
SMILES: O=C(NCCCN1CCCCC1)Nc1ccc(cc1)S(=O)(=O)Nc1ccccc1C(=O)c1ccccc1
InChI Key: InChIKey=KZLRUEFFWHYSAT-UHFFFAOYSA-N
Data: 2 KI  1 IC50
Activity Spreadsheet -- Enzyme Inhibition Constant Data from BindingDB
Found 3 hits for monomerid = 50243173
Trg + Lig
Ki
nM
ΔG°
kcal/mole
IC50
nM
Kd
nM
EC50/IC50
nM
koff
s-1
kon
M-1s-1
pHTemp
°C
Bradykinin B1 receptor
(Homo sapiens (Human))
BDBM50243173
(CHEMBL487445 | N-(2-Benzoyl-phenyl)-4-[3-(3-piperi...)
Show SMILES O=C(NCCCN1CCCCC1)Nc1ccc(cc1)S(=O)(=O)Nc1ccccc1C(=O)c1ccccc1
Show InChI InChI=1S/C28H32N4O4S/c33-27(22-10-3-1-4-11-22)25-12-5-6-13-26(25)31-37(35,36)24-16-14-23(15-17-24)30-28(34)29-18-9-21-32-19-7-2-8-20-32/h1,3-6,10-17,31H,2,7-9,18-21H2,(H2,29,30,34)
0.25n/an/an/an/an/an/an/an/a
Johnson& Johnson Pharmaceutical Research and Development
Curated by ChEMBL
Assay Description
Displacement of [3H]Lys0-des-Arg9-BK at human bradykinin B1 receptor expressed in HEK293 cells
J Med Chem 53: 5383-99 (2010)
Article DOI: 10.1021/jm1000776
BindingDB Entry DOI: 10.7270/Q289162Z
Bradykinin B1 receptor
(Homo sapiens (Human))
BDBM50243173
(CHEMBL487445 | N-(2-Benzoyl-phenyl)-4-[3-(3-piperi...)
Show SMILES O=C(NCCCN1CCCCC1)Nc1ccc(cc1)S(=O)(=O)Nc1ccccc1C(=O)c1ccccc1
Show InChI InChI=1S/C28H32N4O4S/c33-27(22-10-3-1-4-11-22)25-12-5-6-13-26(25)31-37(35,36)24-16-14-23(15-17-24)30-28(34)29-18-9-21-32-19-7-2-8-20-32/h1,3-6,10-17,31H,2,7-9,18-21H2,(H2,29,30,34)
0.25n/an/an/an/an/an/an/an/a
Merck Research Laboratories
Curated by ChEMBL
Assay Description
Binding affinity to human bradykinin B1 receptor
J Med Chem 51: 3946-52 (2008)
Article DOI: 10.1021/jm800199h
BindingDB Entry DOI: 10.7270/Q2JH3N33
Potassium voltage-gated channel subfamily H member 2
(Homo sapiens (Human))
BDBM50243173
(CHEMBL487445 | N-(2-Benzoyl-phenyl)-4-[3-(3-piperi...)
Show SMILES O=C(NCCCN1CCCCC1)Nc1ccc(cc1)S(=O)(=O)Nc1ccccc1C(=O)c1ccccc1
Show InChI InChI=1S/C28H32N4O4S/c33-27(22-10-3-1-4-11-22)25-12-5-6-13-26(25)31-37(35,36)24-16-14-23(15-17-24)30-28(34)29-18-9-21-32-19-7-2-8-20-32/h1,3-6,10-17,31H,2,7-9,18-21H2,(H2,29,30,34)
Reactome pathway
n/an/a 1.00E+3n/an/an/an/an/an/a
Merck Research Laboratories
Curated by ChEMBL
Assay Description
Displacement of MK-499 from human ERG channel in HEK293 cells
J Med Chem 51: 3946-52 (2008)
Article DOI: 10.1021/jm800199h
BindingDB Entry DOI: 10.7270/Q2JH3N33