BDBM50244093 1-hydroxypropane-1,2,3-tricarboxylate::isocitrate::isocitrate(3-)
SMILES: OC(C(CC([O-])=O)C([O-])=O)C([O-])=O
InChI Key: InChIKey=ODBLHEXUDAPZAU-UHFFFAOYSA-K
Data: 1 KI  1 IC50
Activity Spreadsheet -- Enzyme Inhibition Constant Data from BindingDB
Found 2 hits for monomerid = 50244093
Trg + Lig
Ki
nM
ΔG°
kcal/mole
IC50
nM
Kd
nM
EC50/IC50
nM
koff
s-1
kon
M-1s-1
pHTemp
°C
Beta-lactamase
(Bacillus licheniformis)
BDBM50244093
(1-hydroxypropane-1,2,3-tricarboxylate | isocitrate...)
Show SMILES OC(C(CC([O-])=O)C([O-])=O)C([O-])=O
Show InChI InChI=1S/C6H8O7/c7-3(8)1-2(5(10)11)4(9)6(12)13/h2,4,9H,1H2,(H,7,8)(H,10,11)(H,12,13)/p-3
2.20E+6n/an/an/an/an/an/a5.0n/a
Universit£ Catholique de Louvain
Curated by ChEMBL
Assay Description
Inhibition of Bacillus licheniformis BS3 beta-lactamase at pH 5
Bioorg Med Chem Lett 19: 3593-7 (2009)
Article DOI: 10.1016/j.bmcl.2009.04.149
BindingDB Entry DOI: 10.7270/Q2W9597J
Egl nine homolog 1
(Homo sapiens (Human))
BDBM50244093
(1-hydroxypropane-1,2,3-tricarboxylate | isocitrate...)
Show SMILES OC(C(CC([O-])=O)C([O-])=O)C([O-])=O
Show InChI InChI=1S/C6H8O7/c7-3(8)1-2(5(10)11)4(9)6(12)13/h2,4,9H,1H2,(H,7,8)(H,10,11)(H,12,13)/p-3
Reactome pathway
n/an/a>1.00E+7n/an/an/an/an/an/a
University of Oxford
Curated by ChEMBL
Assay Description
Inhibition of PHD2 (unknown origin)
J Med Chem 56: 547-55 (2013)
Article DOI: 10.1021/jm301583m
BindingDB Entry DOI: 10.7270/Q26Q1ZJV