BDBM50244233 CHEMBL513067::trans-4-(((4-tert-butylcyclohexyl)(5-methoxy-1-methyl-1H-benzo[d]imidazol-2-yl)amino)methyl)-N-(1H-tetrazol-5-yl)benzamide
SMILES: COc1ccc2n(C)c(nc2c1)N(Cc1ccc(cc1)C(=O)Nc1nnn[nH]1)[C@H]1CC[C@@H](CC1)C(C)(C)C
InChI Key: InChIKey=QXZDLLBFWVISIF-MEMLXQNLSA-N
Data: 4 IC50
Activity Spreadsheet -- Enzyme Inhibition Constant Data from BindingDB
Found 4 hits for monomerid = 50244233
Trg + Lig
Ki
nM
ΔG°
kcal/mole
IC50
nM
Kd
nM
EC50/IC50
nM
koff
s-1
kon
M-1s-1
pHTemp
°C
Glucagon receptor
(Homo sapiens (Human))
BDBM50244233
(CHEMBL513067 | trans-4-(((4-tert-butylcyclohexyl)(...)
Show SMILES COc1ccc2n(C)c(nc2c1)N(Cc1ccc(cc1)C(=O)Nc1nnn[nH]1)[C@H]1CC[C@@H](CC1)C(C)(C)C |r,wU:28.31,wD:31.38,(13.19,-24.98,;12.38,-26.29,;13.12,-27.64,;12.32,-28.96,;13.06,-30.31,;14.59,-30.34,;15.59,-31.52,;14.82,-32.85,;17.02,-30.92,;16.89,-29.39,;15.39,-29.03,;14.66,-27.68,;18.35,-31.7,;18.34,-33.24,;19.67,-34.02,;21,-33.25,;22.33,-34.03,;22.32,-35.57,;20.97,-36.33,;19.65,-35.55,;23.65,-36.35,;23.64,-37.89,;24.99,-35.59,;26.32,-36.37,;26.83,-37.81,;28.37,-37.78,;28.81,-36.3,;27.55,-35.43,;19.68,-30.94,;19.68,-29.4,;21.03,-28.64,;22.36,-29.42,;22.34,-30.96,;21.01,-31.72,;23.7,-28.67,;25.02,-27.89,;24.47,-30,;22.93,-27.33,)|
Show InChI InChI=1S/C28H36N8O2/c1-28(2,3)20-10-12-21(13-11-20)36(27-29-23-16-22(38-5)14-15-24(23)35(27)4)17-18-6-8-19(9-7-18)25(37)30-26-31-33-34-32-26/h6-9,14-16,20-21H,10-13,17H2,1-5H3,(H2,30,31,32,33,34,37)/t20-,21-
n/an/a 38n/an/an/an/an/an/a
Merck Research Laboratories
Curated by ChEMBL
Assay Description
Antagonist activity against human GCGR expressed in CHO cells assessed as glucagon-induced cAMP accumulation
Bioorg Med Chem Lett 18: 3701-5 (2008)
Article DOI: 10.1016/j.bmcl.2008.05.072
BindingDB Entry DOI: 10.7270/Q26Q1X25
Glucagon receptor
(Homo sapiens (Human))
BDBM50244233
(CHEMBL513067 | trans-4-(((4-tert-butylcyclohexyl)(...)
Show SMILES COc1ccc2n(C)c(nc2c1)N(Cc1ccc(cc1)C(=O)Nc1nnn[nH]1)[C@H]1CC[C@@H](CC1)C(C)(C)C |r,wU:28.31,wD:31.38,(13.19,-24.98,;12.38,-26.29,;13.12,-27.64,;12.32,-28.96,;13.06,-30.31,;14.59,-30.34,;15.59,-31.52,;14.82,-32.85,;17.02,-30.92,;16.89,-29.39,;15.39,-29.03,;14.66,-27.68,;18.35,-31.7,;18.34,-33.24,;19.67,-34.02,;21,-33.25,;22.33,-34.03,;22.32,-35.57,;20.97,-36.33,;19.65,-35.55,;23.65,-36.35,;23.64,-37.89,;24.99,-35.59,;26.32,-36.37,;26.83,-37.81,;28.37,-37.78,;28.81,-36.3,;27.55,-35.43,;19.68,-30.94,;19.68,-29.4,;21.03,-28.64,;22.36,-29.42,;22.34,-30.96,;21.01,-31.72,;23.7,-28.67,;25.02,-27.89,;24.47,-30,;22.93,-27.33,)|
Show InChI InChI=1S/C28H36N8O2/c1-28(2,3)20-10-12-21(13-11-20)36(27-29-23-16-22(38-5)14-15-24(23)35(27)4)17-18-6-8-19(9-7-18)25(37)30-26-31-33-34-32-26/h6-9,14-16,20-21H,10-13,17H2,1-5H3,(H2,30,31,32,33,34,37)/t20-,21-
n/an/a 4n/an/an/an/an/an/a
Merck Research Laboratories
Curated by ChEMBL
Assay Description
Displacement of [125I]glucagon from human GCGR expressed in CHO cells
Bioorg Med Chem Lett 18: 3701-5 (2008)
Article DOI: 10.1016/j.bmcl.2008.05.072
BindingDB Entry DOI: 10.7270/Q26Q1X25
Gastric inhibitory polypeptide
(Homo sapiens (Human))
BDBM50244233
(CHEMBL513067 | trans-4-(((4-tert-butylcyclohexyl)(...)
Show SMILES COc1ccc2n(C)c(nc2c1)N(Cc1ccc(cc1)C(=O)Nc1nnn[nH]1)[C@H]1CC[C@@H](CC1)C(C)(C)C |r,wU:28.31,wD:31.38,(13.19,-24.98,;12.38,-26.29,;13.12,-27.64,;12.32,-28.96,;13.06,-30.31,;14.59,-30.34,;15.59,-31.52,;14.82,-32.85,;17.02,-30.92,;16.89,-29.39,;15.39,-29.03,;14.66,-27.68,;18.35,-31.7,;18.34,-33.24,;19.67,-34.02,;21,-33.25,;22.33,-34.03,;22.32,-35.57,;20.97,-36.33,;19.65,-35.55,;23.65,-36.35,;23.64,-37.89,;24.99,-35.59,;26.32,-36.37,;26.83,-37.81,;28.37,-37.78,;28.81,-36.3,;27.55,-35.43,;19.68,-30.94,;19.68,-29.4,;21.03,-28.64,;22.36,-29.42,;22.34,-30.96,;21.01,-31.72,;23.7,-28.67,;25.02,-27.89,;24.47,-30,;22.93,-27.33,)|
Show InChI InChI=1S/C28H36N8O2/c1-28(2,3)20-10-12-21(13-11-20)36(27-29-23-16-22(38-5)14-15-24(23)35(27)4)17-18-6-8-19(9-7-18)25(37)30-26-31-33-34-32-26/h6-9,14-16,20-21H,10-13,17H2,1-5H3,(H2,30,31,32,33,34,37)/t20-,21-
Reactome pathway
n/an/a 2.50E+3n/an/an/an/an/an/a
Merck Research Laboratories
Curated by ChEMBL
Assay Description
Binding affinity against human GIP
Bioorg Med Chem Lett 18: 3701-5 (2008)
Article DOI: 10.1016/j.bmcl.2008.05.072
BindingDB Entry DOI: 10.7270/Q26Q1X25
Glucagon
(Homo sapiens (Human))
BDBM50244233
(CHEMBL513067 | trans-4-(((4-tert-butylcyclohexyl)(...)
Show SMILES COc1ccc2n(C)c(nc2c1)N(Cc1ccc(cc1)C(=O)Nc1nnn[nH]1)[C@H]1CC[C@@H](CC1)C(C)(C)C |r,wU:28.31,wD:31.38,(13.19,-24.98,;12.38,-26.29,;13.12,-27.64,;12.32,-28.96,;13.06,-30.31,;14.59,-30.34,;15.59,-31.52,;14.82,-32.85,;17.02,-30.92,;16.89,-29.39,;15.39,-29.03,;14.66,-27.68,;18.35,-31.7,;18.34,-33.24,;19.67,-34.02,;21,-33.25,;22.33,-34.03,;22.32,-35.57,;20.97,-36.33,;19.65,-35.55,;23.65,-36.35,;23.64,-37.89,;24.99,-35.59,;26.32,-36.37,;26.83,-37.81,;28.37,-37.78,;28.81,-36.3,;27.55,-35.43,;19.68,-30.94,;19.68,-29.4,;21.03,-28.64,;22.36,-29.42,;22.34,-30.96,;21.01,-31.72,;23.7,-28.67,;25.02,-27.89,;24.47,-30,;22.93,-27.33,)|
Show InChI InChI=1S/C28H36N8O2/c1-28(2,3)20-10-12-21(13-11-20)36(27-29-23-16-22(38-5)14-15-24(23)35(27)4)17-18-6-8-19(9-7-18)25(37)30-26-31-33-34-32-26/h6-9,14-16,20-21H,10-13,17H2,1-5H3,(H2,30,31,32,33,34,37)/t20-,21-
Reactome pathway
n/an/a 5.90E+3n/an/an/an/an/an/a
Merck Research Laboratories
Curated by ChEMBL
Assay Description
Binding affinity against human GLP1
Bioorg Med Chem Lett 18: 3701-5 (2008)
Article DOI: 10.1016/j.bmcl.2008.05.072
BindingDB Entry DOI: 10.7270/Q26Q1X25