BDBM50245999 CHEMBL4084502
SMILES: C[C@H]1[C@@H](OC(=O)N1c1cc(Cl)cc(c1)C#N)c1ccc(F)cc1
InChI Key: InChIKey=HLILQXQIGQCPRZ-MGPLVRAMSA-N
Data: 2 IC50
Activity Spreadsheet -- Enzyme Inhibition Constant Data from BindingDB
Found 2 hits for monomerid = 50245999
Trg + Lig
Ki
nM
ΔG°
kcal/mole
IC50
nM
Kd
nM
EC50/IC50
nM
koff
s-1
kon
M-1s-1
pHTemp
°C
Acyl-CoA (8-3)-desaturase
(Rattus norvegicus)
BDBM50245999
(CHEMBL4084502)
Show SMILES C[C@H]1[C@@H](OC(=O)N1c1cc(Cl)cc(c1)C#N)c1ccc(F)cc1 |r|
Show InChI InChI=1S/C17H12ClFN2O2/c1-10-16(12-2-4-14(19)5-3-12)23-17(22)21(10)15-7-11(9-20)6-13(18)8-15/h2-8,10,16H,1H3/t10-,16+/m0/s1
Reactome pathway
n/an/a<1n/an/an/an/an/an/a
Takeda Pharmaceutical Company Limited
Curated by ChEMBL
Assay Description
Displacement of [3H]T-3364366 from D5D in rat liver microsomal membrane preincubated for 15 mins followed by radioligand addition measured after 150 ...
J Med Chem 60: 8963-8981 (2017)
Article DOI: 10.1021/acs.jmedchem.7b01210
BindingDB Entry DOI: 10.7270/Q23N25S7
Acyl-CoA (8-3)-desaturase
(Homo sapiens (Human))
BDBM50245999
(CHEMBL4084502)
Show SMILES C[C@H]1[C@@H](OC(=O)N1c1cc(Cl)cc(c1)C#N)c1ccc(F)cc1 |r|
Show InChI InChI=1S/C17H12ClFN2O2/c1-10-16(12-2-4-14(19)5-3-12)23-17(22)21(10)15-7-11(9-20)6-13(18)8-15/h2-8,10,16H,1H3/t10-,16+/m0/s1
Reactome pathway
n/an/a 0.520n/an/an/an/an/an/a
Takeda Pharmaceutical Company Limited
Curated by ChEMBL
Assay Description
Inhibition of D5D in human HepG2 cells assessed as [14C]AA formation from [14C]DGLA preincubated for 30 mins followed by [14C]eicosatrienoic acid add...
J Med Chem 60: 8963-8981 (2017)
Article DOI: 10.1021/acs.jmedchem.7b01210
BindingDB Entry DOI: 10.7270/Q23N25S7