null
SMILES: Clc1ccccc1Nc1ncc(-c2ccccc2)n2cncc12
InChI Key: InChIKey=NNBICZMPIJMWGC-UHFFFAOYSA-N
PDB links: 1 PDB ID matches this monomer.
Activity Spreadsheet -- Enzyme Inhibition Constant Data from BindingDB
Found 1 hit for monomerid = 50246553
Trg + Lig
Ki
nM
ΔG°
kcal/mole
IC50
nM
Kd
nM
EC50/IC50
nM
koff
s-1
kon
M-1s-1
pHTemp
°C
Tyrosine-protein kinase Lck
(Homo sapiens (Human))
BDBM50246553
(CHEMBL462228 | N-(2-chlorophenyl)-5-phenylimidazo[...)
Show SMILES Clc1ccccc1Nc1ncc(-c2ccccc2)n2cncc12
Show InChI InChI=1S/C18H13ClN4/c19-14-8-4-5-9-15(14)22-18-17-10-20-12-23(17)16(11-21-18)13-6-2-1-3-7-13/h1-12H,(H,21,22)
n/an/a 220n/an/an/an/an/an/a
Kissei Pharmaceutical Company Ltd.
Curated by ChEMBL
Assay Description
Inhibition of LCK (unknown origin)
Bioorg Med Chem 16: 10311-8 (2008)
Article DOI: 10.1016/j.bmc.2008.10.041
BindingDB Entry DOI: 10.7270/Q2W37W5C
3D
3D Structure (crystal)