BDBM50249117 5-chloro-N-(5-chloropyridin-2-yl)-2-(4-(N,N-dimethylcarbamimidoyl)benzamido)-3-isopropoxybenzamide::CHEMBL475551
SMILES: CC(C)Oc1cc(Cl)cc(C(=O)Nc2ccc(Cl)cn2)c1NC(=O)c1ccc(cc1)C(=N)N(C)C
InChI Key: InChIKey=BCYFDAXBALEALQ-UHFFFAOYSA-N
Data: 1 IC50
Activity Spreadsheet -- Enzyme Inhibition Constant Data from BindingDB
Found 1 hit for monomerid = 50249117
Trg + Lig
Ki
nM
ΔG°
kcal/mole
IC50
nM
Kd
nM
EC50/IC50
nM
koff
s-1
kon
M-1s-1
pHTemp
°C
Coagulation factor X
(Homo sapiens (Human))
BDBM50249117
(5-chloro-N-(5-chloropyridin-2-yl)-2-(4-(N,N-dimeth...)
Show SMILES CC(C)Oc1cc(Cl)cc(C(=O)Nc2ccc(Cl)cn2)c1NC(=O)c1ccc(cc1)C(=N)N(C)C
Show InChI InChI=1S/C25H25Cl2N5O3/c1-14(2)35-20-12-18(27)11-19(25(34)30-21-10-9-17(26)13-29-21)22(20)31-24(33)16-7-5-15(6-8-16)23(28)32(3)4/h5-14,28H,1-4H3,(H,31,33)(H,29,30,34)
Reactome pathway
n/an/a 0.5n/an/an/an/an/an/a
Millennium Pharmaceuticals, Inc
Curated by ChEMBL
Assay Description
Inhibition of Factor 10a (unknown origin)
Bioorg Med Chem Lett 19: 2179-85 (2009)
Article DOI: 10.1016/j.bmcl.2009.02.111
BindingDB Entry DOI: 10.7270/Q22Z15F5