BDBM50250011 CHEMBL4098582
SMILES: Nc1ncnc2n(CC3CCNCC3)nc(Nc3cccc(Cl)c3)c12
InChI Key: InChIKey=IJJLABCMFRRRHJ-UHFFFAOYSA-N
Data: 2 IC50
Activity Spreadsheet -- Enzyme Inhibition Constant Data from BindingDB
Found 4 hits for monomerid = 50250011
Trg + Lig
Ki
nM
ΔG°
kcal/mole
IC50
nM
Kd
nM
EC50/IC50
nM
koff
s-1
kon
M-1s-1
pHTemp
°C
Calmodulin-domain protein kinase 1 (CDPK1)
(Toxoplasma gondii)
BDBM50250011
(CHEMBL4098582 | US11208411, Compound GXJ276)
Show SMILES Nc1ncnc2n(CC3CCNCC3)nc(Nc3cccc(Cl)c3)c12
Show InChI InChI=1S/C17H20ClN7/c18-12-2-1-3-13(8-12)23-16-14-15(19)21-10-22-17(14)25(24-16)9-11-4-6-20-7-5-11/h1-3,8,10-11,20H,4-7,9H2,(H,23,24)(H2,19,21,22)
n/an/a 16n/an/an/an/an/an/a
University of California
Curated by ChEMBL
Assay Description
Inhibition of C-terminal His-tagged full length Toxoplasma gondii CDPK1 expressed in Escherichia coli BL21 (DE3) using syntide-2 as substrate pre-inc...
J Med Chem 60: 9976-9989 (2017)
Article DOI: 10.1021/acs.jmedchem.7b01192
BindingDB Entry DOI: 10.7270/Q21G0PP0
Protein cereblon/Tyrosine-protein kinase SRC
(Homo sapiens (Human))
BDBM50250011
(CHEMBL4098582 | US11208411, Compound GXJ276)
Show SMILES Nc1ncnc2n(CC3CCNCC3)nc(Nc3cccc(Cl)c3)c12
Show InChI InChI=1S/C17H20ClN7/c18-12-2-1-3-13(8-12)23-16-14-15(19)21-10-22-17(14)25(24-16)9-11-4-6-20-7-5-11/h1-3,8,10-11,20H,4-7,9H2,(H,23,24)(H2,19,21,22)
n/an/a 901n/an/an/an/an/an/a
TBA
Citation and Details
CAM kinase, CDPK family TgCDPK1
(Toxoplasma gondii (strain ATCC 50861 / VEG))
BDBM50250011
(CHEMBL4098582 | US11208411, Compound GXJ276)
Show SMILES Nc1ncnc2n(CC3CCNCC3)nc(Nc3cccc(Cl)c3)c12
Show InChI InChI=1S/C17H20ClN7/c18-12-2-1-3-13(8-12)23-16-14-15(19)21-10-22-17(14)25(24-16)9-11-4-6-20-7-5-11/h1-3,8,10-11,20H,4-7,9H2,(H,23,24)(H2,19,21,22)
n/an/a 16.4n/an/an/an/an/an/a
TBA
Citation and Details
Proto-oncogene tyrosine-protein kinase Src
(Homo sapiens (Human))
BDBM50250011
(CHEMBL4098582 | US11208411, Compound GXJ276)
Show SMILES Nc1ncnc2n(CC3CCNCC3)nc(Nc3cccc(Cl)c3)c12
Show InChI InChI=1S/C17H20ClN7/c18-12-2-1-3-13(8-12)23-16-14-15(19)21-10-22-17(14)25(24-16)9-11-4-6-20-7-5-11/h1-3,8,10-11,20H,4-7,9H2,(H,23,24)(H2,19,21,22)
n/an/a 901n/an/an/an/an/an/a
University of California
Curated by ChEMBL
Assay Description
Inhibition of human Src kinase domain (254 to 536 residues) expressed in Escherichia coli BL21 (DE3) using abltide as substrate pre-incubated for 10 ...
J Med Chem 60: 9976-9989 (2017)
Article DOI: 10.1021/acs.jmedchem.7b01192
BindingDB Entry DOI: 10.7270/Q21G0PP0