BDBM50250338 CHEMBL4077186
SMILES: N#Cc1c[nH]c2nccc(-c3ccccc3)c12
InChI Key: InChIKey=WRQMDDJZRIRGLV-UHFFFAOYSA-N
Data: 2 KI  2 IC50
Activity Spreadsheet -- Enzyme Inhibition Constant Data from BindingDB
Found 4 hits for monomerid = 50250338
Trg + Lig
Ki
nM
ΔG°
kcal/mole
IC50
nM
Kd
nM
EC50/IC50
nM
koff
s-1
kon
M-1s-1
pHTemp
°C
Leucine-rich repeat serine/threonine-protein kinase 2
(Homo sapiens (Human))
BDBM50250338
(CHEMBL4077186)
Show SMILES N#Cc1c[nH]c2nccc(-c3ccccc3)c12
Show InChI InChI=1S/C14H9N3/c15-8-11-9-17-14-13(11)12(6-7-16-14)10-4-2-1-3-5-10/h1-7,9H,(H,16,17)
23n/an/an/an/an/an/an/an/a
Vernalis (R&D) Ltd.
Curated by ChEMBL
Assay Description
Inhibition of wild type recombinant human GST-tagged LRRK2 (970 to 2527 residues) expressed in baculovirus using fluorescein-LRRKtide as substrate af...
J Med Chem 60: 8945-8962 (2017)
Article DOI: 10.1021/acs.jmedchem.7b01186
BindingDB Entry DOI: 10.7270/Q2BR8VMR
Leucine-rich repeat serine/threonine-protein kinase 2 (LRRK2)
(Homo sapiens (Human))
BDBM50250338
(CHEMBL4077186)
Show SMILES N#Cc1c[nH]c2nccc(-c3ccccc3)c12
Show InChI InChI=1S/C14H9N3/c15-8-11-9-17-14-13(11)12(6-7-16-14)10-4-2-1-3-5-10/h1-7,9H,(H,16,17)
81n/an/an/an/an/an/an/an/a
Vernalis (R&D) Ltd.
Curated by ChEMBL
Assay Description
Inhibition of human wild type LRRK2 phosphorylation at ser935 transfected in HEK293 cells after 48 hrs by in-cell Western assay
J Med Chem 60: 8945-8962 (2017)
Article DOI: 10.1021/acs.jmedchem.7b01186
BindingDB Entry DOI: 10.7270/Q2BR8VMR
Leucine-rich repeat serine/threonine-protein kinase 2
(Homo sapiens (Human))
BDBM50250338
(CHEMBL4077186)
Show SMILES N#Cc1c[nH]c2nccc(-c3ccccc3)c12
Show InChI InChI=1S/C14H9N3/c15-8-11-9-17-14-13(11)12(6-7-16-14)10-4-2-1-3-5-10/h1-7,9H,(H,16,17)
n/an/a 1.18E+3n/an/an/an/an/an/a
Vernalis (R&D) Ltd.
Curated by ChEMBL
Assay Description
Inhibition of recombinant human GST-tagged LRRK2 G2019S mutant (970 to 2527 residues) expressed in baculovirus using fluorescein-LRRKtide as substrat...
J Med Chem 60: 8945-8962 (2017)
Article DOI: 10.1021/acs.jmedchem.7b01186
BindingDB Entry DOI: 10.7270/Q2BR8VMR
Leucine-rich repeat serine/threonine-protein kinase 2
(Homo sapiens (Human))
BDBM50250338
(CHEMBL4077186)
Show SMILES N#Cc1c[nH]c2nccc(-c3ccccc3)c12
Show InChI InChI=1S/C14H9N3/c15-8-11-9-17-14-13(11)12(6-7-16-14)10-4-2-1-3-5-10/h1-7,9H,(H,16,17)
n/an/a 954n/an/an/an/an/an/a
Vernalis (R&D) Ltd.
Curated by ChEMBL
Assay Description
Inhibition of wild type recombinant human GST-tagged LRRK2 (970 to 2527 residues) expressed in baculovirus using fluorescein-LRRKtide as substrate af...
J Med Chem 60: 8945-8962 (2017)
Article DOI: 10.1021/acs.jmedchem.7b01186
BindingDB Entry DOI: 10.7270/Q2BR8VMR