BDBM50251923 CHEMBL481750::cis-{4-[4-(4-Fluoro-phenyl)-2-methylsulfanyl-1H-imidazol-5-yl]-pyridin-2-yl}-(4-methylcyclohexyl)-amine
SMILES: CSc1nc(c([nH]1)-c1ccc(F)cc1)-c1ccnc(N[C@@H]2CC[C@H](C)CC2)c1
InChI Key: InChIKey=DDHYZAOORBKEHA-UJKQEGAGSA-N
Data: 1 IC50
Activity Spreadsheet -- Enzyme Inhibition Constant Data from BindingDB
Found 1 hit for monomerid = 50251923
Trg + Lig
Ki
nM
ΔG°
kcal/mole
IC50
nM
Kd
nM
EC50/IC50
nM
koff
s-1
kon
M-1s-1
pHTemp
°C
Mitogen-activated protein kinase 14
(Homo sapiens (Human))
BDBM50251923
(CHEMBL481750 | cis-{4-[4-(4-Fluoro-phenyl)-2-methy...)
Show SMILES CSc1nc(c([nH]1)-c1ccc(F)cc1)-c1ccnc(N[C@@H]2CC[C@H](C)CC2)c1 |r,wU:20.21,23.25,(43.41,-32.21,;42.64,-30.87,;41.1,-30.87,;40.19,-32.11,;38.73,-31.63,;38.73,-30.09,;40.2,-29.62,;37.4,-29.32,;37.42,-27.77,;36.09,-26.99,;34.75,-27.76,;33.42,-26.98,;34.74,-29.3,;36.07,-30.08,;37.4,-32.4,;36.06,-31.62,;34.73,-32.39,;34.73,-33.93,;36.07,-34.7,;36.08,-36.24,;37.42,-37.02,;37.44,-38.55,;38.77,-39.32,;40.1,-38.55,;41.43,-39.32,;40.1,-37.01,;38.76,-36.24,;37.4,-33.93,)|
Show InChI InChI=1S/C22H25FN4S/c1-14-3-9-18(10-4-14)25-19-13-16(11-12-24-19)21-20(26-22(27-21)28-2)15-5-7-17(23)8-6-15/h5-8,11-14,18H,3-4,9-10H2,1-2H3,(H,24,25)(H,26,27)/t14-,18+
NCI pathway
Reactome pathway
n/an/a 31n/an/an/an/an/an/a
Eberhard-Karls-University Tuebingen
Curated by ChEMBL
Assay Description
Inhibition of p38alpha
J Med Chem 51: 4122-49 (2008)
Article DOI: 10.1021/jm701529q
BindingDB Entry DOI: 10.7270/Q2W37X67