BDBM50252077 (1-methyl-4-(4-nitrophenylamino)-1H-pyrrol-2-yl)(pyrrolidin-1-yl)methanone::CHEMBL516610
SMILES: Cn1cc(Nc2ccc(cc2)[N+]([O-])=O)cc1C(=O)N1CCCC1
InChI Key: InChIKey=QIMAQOUMOREGLL-UHFFFAOYSA-N
Data: 1 KI  1 IC50
Activity Spreadsheet -- Enzyme Inhibition Constant Data from BindingDB
Found 2 hits for monomerid = 50252077
Trg + Lig
Ki
nM
ΔG°
kcal/mole
IC50
nM
Kd
nM
EC50/IC50
nM
koff
s-1
kon
M-1s-1
pHTemp
°C
Androgen Receptor
(Homo sapiens (Human))
BDBM50252077
((1-methyl-4-(4-nitrophenylamino)-1H-pyrrol-2-yl)(p...)
Show SMILES Cn1cc(Nc2ccc(cc2)[N+]([O-])=O)cc1C(=O)N1CCCC1
Show InChI InChI=1S/C16H18N4O3/c1-18-11-13(10-15(18)16(21)19-8-2-3-9-19)17-12-4-6-14(7-5-12)20(22)23/h4-7,10-11,17H,2-3,8-9H2,1H3
NCI pathway
Reactome pathway
4.90E+3n/an/an/an/an/an/an/an/a
The University of Tokyo
Curated by ChEMBL
Assay Description
Displacement of [3H]testosterone from wild type human androgen receptor
Bioorg Med Chem 16: 6799-812 (2008)
Article DOI: 10.1016/j.bmc.2008.05.063
BindingDB Entry DOI: 10.7270/Q2MK6CPV
Androgen Receptor
(Homo sapiens (Human))
BDBM50252077
((1-methyl-4-(4-nitrophenylamino)-1H-pyrrol-2-yl)(p...)
Show SMILES Cn1cc(Nc2ccc(cc2)[N+]([O-])=O)cc1C(=O)N1CCCC1
Show InChI InChI=1S/C16H18N4O3/c1-18-11-13(10-15(18)16(21)19-8-2-3-9-19)17-12-4-6-14(7-5-12)20(22)23/h4-7,10-11,17H,2-3,8-9H2,1H3
NCI pathway
Reactome pathway
n/an/a 1.47E+4n/an/an/an/an/an/a
The University of Tokyo
Curated by ChEMBL
Assay Description
Antagonist activity at wild type human recombinant androgen receptor assessed as inhibition of testosterone-induced growth of mouse androgen dependen...
Bioorg Med Chem 16: 6799-812 (2008)
Article DOI: 10.1016/j.bmc.2008.05.063
BindingDB Entry DOI: 10.7270/Q2MK6CPV