BDBM50254427 CHEMBL4067095
SMILES: Fc1ccc(cc1)-c1n[nH]c2cc(OC(F)(F)F)cnc12
InChI Key: InChIKey=XIHLXICJADAAMG-UHFFFAOYSA-N
Data: 2 IC50
Activity Spreadsheet -- Enzyme Inhibition Constant Data from BindingDB
Found 2 hits for monomerid = 50254427
Trg + Lig
Ki
nM
ΔG°
kcal/mole
IC50
nM
Kd
nM
EC50/IC50
nM
koff
s-1
kon
M-1s-1
pHTemp
°C
Transient receptor potential cation channel subfamily A member 1
(Rattus norvegicus)
BDBM50254427
(CHEMBL4067095)
Show SMILES Fc1ccc(cc1)-c1n[nH]c2cc(OC(F)(F)F)cnc12
Show InChI InChI=1S/C13H7F4N3O/c14-8-3-1-7(2-4-8)11-12-10(19-20-11)5-9(6-18-12)21-13(15,16)17/h1-6H,(H,19,20)
n/an/a 216n/an/an/an/an/an/a
Pfizer Worldwide Medicinal Chemistry, Neuroscience and Pain Research Unit, Portway Building, Granta Park, Great Abington, Cambridgeshire CB21 6GS, U.K.
Curated by ChEMBL
Assay Description
Inhibition of full length rat TRPA1 at a holding potential of 15 mV measured after 1 min by PatchXpress electrophysiology assay
ACS Med Chem Lett 8: 666-671 (2017)
Article DOI: 10.1021/acsmedchemlett.7b00140
BindingDB Entry DOI: 10.7270/Q2C24ZWG
Transient receptor potential cation channel subfamily A member 1
(Homo sapiens (Human))
BDBM50254427
(CHEMBL4067095)
Show SMILES Fc1ccc(cc1)-c1n[nH]c2cc(OC(F)(F)F)cnc12
Show InChI InChI=1S/C13H7F4N3O/c14-8-3-1-7(2-4-8)11-12-10(19-20-11)5-9(6-18-12)21-13(15,16)17/h1-6H,(H,19,20)
n/an/a 257n/an/an/an/an/an/a
Pfizer Worldwide Medicinal Chemistry, Neuroscience and Pain Research Unit, Portway Building, Granta Park, Great Abington, Cambridgeshire CB21 6GS, U.K.
Curated by ChEMBL
Assay Description
Antagonist activity at human TRPA1 by calcium flux based FLIPR assay
ACS Med Chem Lett 8: 666-671 (2017)
Article DOI: 10.1021/acsmedchemlett.7b00140
BindingDB Entry DOI: 10.7270/Q2C24ZWG