BDBM50255360 1-Phenethyl-8,9-dihydro-7H-2,7,9a-triaza-benzo[cd]azulen-6-one::CHEMBL479471
SMILES: O=C1NCCn2c(CCc3ccccc3)nc3cccc1c23
InChI Key: InChIKey=KYJSWIHLMFXRJY-UHFFFAOYSA-N
Data: 1 IC50
Activity Spreadsheet -- Enzyme Inhibition Constant Data from BindingDB
Found 1 hit for monomerid = 50255360
Trg + Lig
Ki
nM
ΔG°
kcal/mole
IC50
nM
Kd
nM
EC50/IC50
nM
koff
s-1
kon
M-1s-1
pHTemp
°C
Poly [ADP-ribose] polymerase 1
(Homo sapiens (Human))
BDBM50255360
(1-Phenethyl-8,9-dihydro-7H-2,7,9a-triaza-benzo[cd]...)
Show SMILES O=C1NCCn2c(CCc3ccccc3)nc3cccc1c23
Show InChI InChI=1S/C18H17N3O/c22-18-14-7-4-8-15-17(14)21(12-11-19-18)16(20-15)10-9-13-5-2-1-3-6-13/h1-8H,9-12H2,(H,19,22)
n/an/a 26n/an/an/an/an/an/a
Huazhong University of Science and Technology
Curated by ChEMBL
Assay Description
Inhibition of human recombinant PARP1
J Med Chem 52: 718-25 (2009)
Article DOI: 10.1021/jm800902t
BindingDB Entry DOI: 10.7270/Q2C53KPW