BDBM50255856 2-amino-N-(4-((4-(pyridin-3-yl)pyrimidin-2-ylamino)methyl)phenyl)benzamide::CHEMBL480730
SMILES: Nc1ccccc1C(=O)Nc1ccc(CNc2nccc(n2)-c2cccnc2)cc1
InChI Key: InChIKey=MKZLPXBFXXXRSF-UHFFFAOYSA-N
Data: 1 IC50
Activity Spreadsheet -- Enzyme Inhibition Constant Data from BindingDB
Found 1 hit for monomerid = 50255856
Trg + Lig
Ki
nM
ΔG°
kcal/mole
IC50
nM
Kd
nM
EC50/IC50
nM
koff
s-1
kon
M-1s-1
pHTemp
°C
Histone deacetylase 1
(Homo sapiens (Human))
BDBM50255856
(2-amino-N-(4-((4-(pyridin-3-yl)pyrimidin-2-ylamino...)
Show SMILES Nc1ccccc1C(=O)Nc1ccc(CNc2nccc(n2)-c2cccnc2)cc1
Show InChI InChI=1S/C23H20N6O/c24-20-6-2-1-5-19(20)22(30)28-18-9-7-16(8-10-18)14-27-23-26-13-11-21(29-23)17-4-3-12-25-15-17/h1-13,15H,14,24H2,(H,28,30)(H,26,27,29)
NCI pathway
Reactome pathway
n/an/a>2.00E+4n/an/an/an/an/an/a
MethylGene Inc.
Curated by ChEMBL
Assay Description
Inhibition of human recombinant HDAC1
Bioorg Med Chem Lett 19: 644-9 (2009)
Article DOI: 10.1016/j.bmcl.2008.12.048
BindingDB Entry DOI: 10.7270/Q2PN95J1