BDBM50256350 CHEMBL4098863
SMILES: Cc1[nH]c(cc1C(N)=O)-c1ccccc1Oc1ccc(Cl)cc1
InChI Key: InChIKey=VYHWNVJEEBHTKR-UHFFFAOYSA-N
Data: 1 KI  1 EC50
PDB links: 1 PDB ID matches this monomer.
Activity Spreadsheet -- Enzyme Inhibition Constant Data from BindingDB
Found 2 hits for monomerid = 50256350
Trg + Lig
Ki
nM
ΔG°
kcal/mole
IC50
nM
Kd
nM
EC50/IC50
nM
koff
s-1
kon
M-1s-1
pHTemp
°C
Bromodomain-containing protein 4
(Homo sapiens (Human))
BDBM50256350
(CHEMBL4098863)
Show SMILES Cc1[nH]c(cc1C(N)=O)-c1ccccc1Oc1ccc(Cl)cc1
Show InChI InChI=1S/C18H15ClN2O2/c1-11-15(18(20)22)10-16(21-11)14-4-2-3-5-17(14)23-13-8-6-12(19)7-9-13/h2-10,21H,1H3,(H2,20,22)
410n/an/an/an/an/an/an/an/a
AbbVie Inc., Oncology Discovery, 1 North Waukegan Rd., North Chicago, IL 60064, USA.
Curated by ChEMBL
Assay Description
Binding affinity to His-tagged BRD4 BD1-BD2 (K57 to K550 residues) (unknown origin) after 1 hr by Alexa-647-conjugated probe based TR-FRET assay
Bioorg Med Chem Lett 27: 2225-2233 (2017)
Article DOI: 10.1016/j.bmcl.2017.02.057
BindingDB Entry DOI: 10.7270/Q20P12FJ
3D
3D Structure (crystal)
Bromodomain-containing protein 4
(Homo sapiens (Human))
BDBM50256350
(CHEMBL4098863)
Show SMILES Cc1[nH]c(cc1C(N)=O)-c1ccccc1Oc1ccc(Cl)cc1
Show InChI InChI=1S/C18H15ClN2O2/c1-11-15(18(20)22)10-16(21-11)14-4-2-3-5-17(14)23-13-8-6-12(19)7-9-13/h2-10,21H,1H3,(H2,20,22)
n/an/an/an/a 280n/an/an/an/a
AbbVie Inc., Oncology Discovery, 1 North Waukegan Rd., North Chicago, IL 60064, USA.
Curated by ChEMBL
Assay Description
Inhibition of BRD4 (unknown origin) expressed in human H1299 cells co-expressing HPV16-LCR/E2 after 24 hrs by Bright Glo-luciferase reporter gene ass...
Bioorg Med Chem Lett 27: 2225-2233 (2017)
Article DOI: 10.1016/j.bmcl.2017.02.057
BindingDB Entry DOI: 10.7270/Q20P12FJ
3D
3D Structure (crystal)