BDBM50257181 CHEMBL2325020
SMILES: CCN1CC(C1)n1nccc1-c1cc(Cl)ccc1Oc1cc(F)c(cc1F)S(=O)(=O)Nc1cscn1
InChI Key: InChIKey=FUEMKENJKYZACX-UHFFFAOYSA-N
Data: 5 IC50
Activity Spreadsheet -- Enzyme Inhibition Constant Data from BindingDB
Found 5 hits for monomerid = 50257181
Trg + Lig
Ki
nM
ΔG°
kcal/mole
IC50
nM
Kd
nM
EC50/IC50
nM
koff
s-1
kon
M-1s-1
pHTemp
°C
Cytochrome P450 3A4
(Homo sapiens (Human))
BDBM50257181
(CHEMBL2325020)
Show SMILES CCN1CC(C1)n1nccc1-c1cc(Cl)ccc1Oc1cc(F)c(cc1F)S(=O)(=O)Nc1cscn1
Show InChI InChI=1S/C23H20ClF2N5O3S2/c1-2-30-10-15(11-30)31-19(5-6-28-31)16-7-14(24)3-4-20(16)34-21-8-18(26)22(9-17(21)25)36(32,33)29-23-12-35-13-27-23/h3-9,12-13,15,29H,2,10-11H2,1H3
Reactome pathway
n/an/a>3.00E+4n/an/an/an/an/an/a
Icagen Inc. , 4222 Emperor Blvd no. 350, Durham, North Carolina 27703, United States.
Curated by ChEMBL
Assay Description
Inhibition of CYP3A4 (unknown origin)
J Med Chem 60: 7029-7042 (2017)
Article DOI: 10.1021/acs.jmedchem.7b00598
BindingDB Entry DOI: 10.7270/Q21G0PQF
Cytochrome P450 2C9
(Homo sapiens (Human))
BDBM50257181
(CHEMBL2325020)
Show SMILES CCN1CC(C1)n1nccc1-c1cc(Cl)ccc1Oc1cc(F)c(cc1F)S(=O)(=O)Nc1cscn1
Show InChI InChI=1S/C23H20ClF2N5O3S2/c1-2-30-10-15(11-30)31-19(5-6-28-31)16-7-14(24)3-4-20(16)34-21-8-18(26)22(9-17(21)25)36(32,33)29-23-12-35-13-27-23/h3-9,12-13,15,29H,2,10-11H2,1H3
Reactome pathway
n/an/a 3.23E+3n/an/an/an/an/an/a
Icagen Inc. , 4222 Emperor Blvd no. 350, Durham, North Carolina 27703, United States.
Curated by ChEMBL
Assay Description
Inhibition of CYP2C9 (unknown origin)
J Med Chem 60: 7029-7042 (2017)
Article DOI: 10.1021/acs.jmedchem.7b00598
BindingDB Entry DOI: 10.7270/Q21G0PQF
Sodium channel protein type 9 subunit alpha
(Homo sapiens (Human))
BDBM50257181
(CHEMBL2325020)
Show SMILES CCN1CC(C1)n1nccc1-c1cc(Cl)ccc1Oc1cc(F)c(cc1F)S(=O)(=O)Nc1cscn1
Show InChI InChI=1S/C23H20ClF2N5O3S2/c1-2-30-10-15(11-30)31-19(5-6-28-31)16-7-14(24)3-4-20(16)34-21-8-18(26)22(9-17(21)25)36(32,33)29-23-12-35-13-27-23/h3-9,12-13,15,29H,2,10-11H2,1H3
n/an/a 9.70n/an/an/an/an/an/a
AstraZeneca
Curated by ChEMBL
Assay Description
Inhibition of NaV1.7 ion channel (unknown origin)
Bioorg Med Chem Lett 23: 261-3 (2013)
Article DOI: 10.1016/j.bmcl.2012.10.102
BindingDB Entry DOI: 10.7270/Q2445QD6
Sodium channel protein type 5 subunit alpha
(Homo sapiens (Human))
BDBM50257181
(CHEMBL2325020)
Show SMILES CCN1CC(C1)n1nccc1-c1cc(Cl)ccc1Oc1cc(F)c(cc1F)S(=O)(=O)Nc1cscn1
Show InChI InChI=1S/C23H20ClF2N5O3S2/c1-2-30-10-15(11-30)31-19(5-6-28-31)16-7-14(24)3-4-20(16)34-21-8-18(26)22(9-17(21)25)36(32,33)29-23-12-35-13-27-23/h3-9,12-13,15,29H,2,10-11H2,1H3
n/an/a>1.00E+4n/an/an/an/an/an/a
Icagen Inc. , 4222 Emperor Blvd no. 350, Durham, North Carolina 27703, United States.
Curated by ChEMBL
Assay Description
Inhibition of human NaV1.5 expressed in HEK cells assessed as half inactivation potential at -120 mV holding potential by automated patch clamp metho...
J Med Chem 60: 7029-7042 (2017)
Article DOI: 10.1021/acs.jmedchem.7b00598
BindingDB Entry DOI: 10.7270/Q21G0PQF
Sodium channel protein type 9 subunit alpha
(Homo sapiens (Human))
BDBM50257181
(CHEMBL2325020)
Show SMILES CCN1CC(C1)n1nccc1-c1cc(Cl)ccc1Oc1cc(F)c(cc1F)S(=O)(=O)Nc1cscn1
Show InChI InChI=1S/C23H20ClF2N5O3S2/c1-2-30-10-15(11-30)31-19(5-6-28-31)16-7-14(24)3-4-20(16)34-21-8-18(26)22(9-17(21)25)36(32,33)29-23-12-35-13-27-23/h3-9,12-13,15,29H,2,10-11H2,1H3
n/an/a 10n/an/an/an/an/an/a
Icagen Inc. , 4222 Emperor Blvd no. 350, Durham, North Carolina 27703, United States.
Curated by ChEMBL
Assay Description
Inhibition of human NaV1.7 expressed in HEK cells assessed as half inactivation potential at -120 mV holding potential by automated patch clamp metho...
J Med Chem 60: 7029-7042 (2017)
Article DOI: 10.1021/acs.jmedchem.7b00598
BindingDB Entry DOI: 10.7270/Q21G0PQF