BDBM50258930 CHEMBL4102321
SMILES: COC[C@@H](NC(=O)N1CC(=O)Nc2cc(OC)cnc12)c1ccc(OC(F)(F)F)cc1
InChI Key: InChIKey=BEQCCXANGRRZOT-OAHLLOKOSA-N
Data: 1 IC50
Activity Spreadsheet -- Enzyme Inhibition Constant Data from BindingDB
Found 1 hit for monomerid = 50258930
Trg + Lig
Ki
nM
ΔG°
kcal/mole
IC50
nM
Kd
nM
EC50/IC50
nM
koff
s-1
kon
M-1s-1
pHTemp
°C
Homo sapiens phosphodiesterase 2A (PDE2A)
(Homo sapiens (Human))
BDBM50258930
(CHEMBL4102321)
Show SMILES COC[C@@H](NC(=O)N1CC(=O)Nc2cc(OC)cnc12)c1ccc(OC(F)(F)F)cc1 |r|
Show InChI InChI=1S/C19H19F3N4O5/c1-29-10-15(11-3-5-12(6-4-11)31-19(20,21)22)25-18(28)26-9-16(27)24-14-7-13(30-2)8-23-17(14)26/h3-8,15H,9-10H2,1-2H3,(H,24,27)(H,25,28)/t15-/m1/s1
n/an/a 1.60n/an/an/an/an/an/a
Takeda Pharmaceutical Company Limited
Curated by ChEMBL
Assay Description
Inhibition of recombinant human FLAG-tagged PDE2A3 expressed in sf21 cells using [3H]cGMP as substrate by scintillation proximity assay
J Med Chem 60: 7677-7702 (2017)
Article DOI: 10.1021/acs.jmedchem.7b00807
BindingDB Entry DOI: 10.7270/Q2P271JR