BDBM50259223 2-tert-butyl-7-(2-chlorophenyl)-6-(4-chlorophenyl)-4-(piperazin-1-yl)pyrido[2,3-d]pyrimidine::CHEMBL466685
SMILES: CC(C)(C)c1nc(N2CCNCC2)c2cc(-c3ccc(Cl)cc3)c(nc2n1)-c1ccccc1Cl
InChI Key: InChIKey=GDWQUUCPLCSPGR-UHFFFAOYSA-N
Data: 2 IC50
Activity Spreadsheet -- Enzyme Inhibition Constant Data from BindingDB
Found 2 hits for monomerid = 50259223
Trg + Lig
Ki
nM
ΔG°
kcal/mole
IC50
nM
Kd
nM
EC50/IC50
nM
koff
s-1
kon
M-1s-1
pHTemp
°C
Cannabinoid receptor 2
(Homo sapiens (Human))
BDBM50259223
(2-tert-butyl-7-(2-chlorophenyl)-6-(4-chlorophenyl)...)
Show SMILES CC(C)(C)c1nc(N2CCNCC2)c2cc(-c3ccc(Cl)cc3)c(nc2n1)-c1ccccc1Cl
Show InChI InChI=1S/C27H27Cl2N5/c1-27(2,3)26-32-24-21(25(33-26)34-14-12-30-13-15-34)16-20(17-8-10-18(28)11-9-17)23(31-24)19-6-4-5-7-22(19)29/h4-11,16,30H,12-15H2,1-3H3
Reactome pathway
n/an/a 1.80E+3n/an/an/an/an/an/a
Merck Research Laboratories
Curated by ChEMBL
Assay Description
Binding affinity to human cannabinoid CB2R expressed in CHO cells
Bioorg Med Chem Lett 19: 2591-4 (2009)
Article DOI: 10.1016/j.bmcl.2009.03.005
BindingDB Entry DOI: 10.7270/Q2PK0G1X
Cannabinoid receptor 1
(Homo sapiens (Human))
BDBM50259223
(2-tert-butyl-7-(2-chlorophenyl)-6-(4-chlorophenyl)...)
Show SMILES CC(C)(C)c1nc(N2CCNCC2)c2cc(-c3ccc(Cl)cc3)c(nc2n1)-c1ccccc1Cl
Show InChI InChI=1S/C27H27Cl2N5/c1-27(2,3)26-32-24-21(25(33-26)34-14-12-30-13-15-34)16-20(17-8-10-18(28)11-9-17)23(31-24)19-6-4-5-7-22(19)29/h4-11,16,30H,12-15H2,1-3H3
NCI pathway
Reactome pathway
n/an/a 1.90n/an/an/an/an/an/a
Merck Research Laboratories
Curated by ChEMBL
Assay Description
Inverse agonist activity at human cannabinoid CB1R expressed in CHO cells assessed as effect on cAMP accumulation
Bioorg Med Chem Lett 19: 2591-4 (2009)
Article DOI: 10.1016/j.bmcl.2009.03.005
BindingDB Entry DOI: 10.7270/Q2PK0G1X