BDBM50259458 (rac)-(1RS,5SR)-7-{4-[3-(2-Bromo-5-fluoro-phenoxy)-propyl]-phenyl}-3-(4-carbamoyl-butyryl)-3,9-diaza-bicyclo[3.3.1]non-6-ene-6-carboxylic acid(2-chloro-benzyl)-cyclopropyl-amide::CHEMBL503710
SMILES: NC(=O)CCCC(=O)N1CC2CC(=C(C(C1)N2)C(=O)N(Cc1ccccc1Cl)C1CC1)c1ccc(CCCOc2cc(Cl)ccc2Br)cc1
InChI Key: InChIKey=PNFMKRFBBKGWQG-UHFFFAOYSA-N
Data: 2 IC50
Activity Spreadsheet -- Enzyme Inhibition Constant Data from BindingDB
Found 2 hits for monomerid = 50259458
Trg + Lig
Ki
nM
ΔG°
kcal/mole
IC50
nM
Kd
nM
EC50/IC50
nM
koff
s-1
kon
M-1s-1
pHTemp
°C
Renin
(Homo sapiens (Human))
BDBM50259458
((rac)-(1RS,5SR)-7-{4-[3-(2-Bromo-5-fluoro-phenoxy)...)
Show SMILES NC(=O)CCCC(=O)N1CC2CC(=C(C(C1)N2)C(=O)N(Cc1ccccc1Cl)C1CC1)c1ccc(CCCOc2cc(Cl)ccc2Br)cc1 |c:12,TLB:31:12:16:8.15.9,6:8:16:13.12.11,THB:17:13:16:8.15.9,(20.78,-8.86,;19.41,-8.14,;19.35,-6.6,;18.11,-8.96,;16.75,-8.25,;15.45,-9.07,;14.08,-8.36,;14.02,-6.82,;12.78,-9.18,;12.24,-10.65,;10.52,-10.31,;11,-8.86,;10.42,-7.98,;9.14,-7.97,;9.86,-9.47,;11.67,-9.8,;9.33,-10.94,;7.6,-7.91,;6.88,-6.55,;6.79,-9.21,;5.25,-9.16,;4.43,-10.46,;5.16,-11.81,;4.35,-13.12,;2.8,-13.07,;2.08,-11.7,;2.9,-10.4,;2.13,-9.07,;7.51,-10.58,;7.46,-12.11,;8.82,-11.39,;11.1,-7.21,;12.64,-7.21,;13.4,-5.87,;12.63,-4.54,;13.39,-3.2,;14.93,-3.19,;15.7,-1.86,;17.24,-1.85,;18,-.51,;19.55,-.52,;20.31,.82,;21.85,.82,;19.54,2.14,;17.99,2.13,;17.23,.8,;15.69,.79,;11.08,-4.55,;10.32,-5.88,)|
Show InChI InChI=1S/C38H41BrCl2N4O4/c39-31-17-14-27(40)19-34(31)49-18-4-5-24-10-12-25(13-11-24)30-20-28-22-44(36(47)9-3-8-35(42)46)23-33(43-28)37(30)38(48)45(29-15-16-29)21-26-6-1-2-7-32(26)41/h1-2,6-7,10-14,17,19,28-29,33,43H,3-5,8-9,15-16,18,20-23H2,(H2,42,46)
Reactome pathway
n/an/a 0.550n/an/an/an/an/an/a
Actelion Pharmaceuticals Ltd.
Curated by ChEMBL
Assay Description
Inhibition of human recombinant rennin in buffer assessed as accumulation of angiotensin 1 using human tetradecapeptide by immunoassay
J Med Chem 52: 3689-702 (2009)
Article DOI: 10.1021/jm900022f
BindingDB Entry DOI: 10.7270/Q2PC3391
Renin
(Homo sapiens (Human))
BDBM50259458
((rac)-(1RS,5SR)-7-{4-[3-(2-Bromo-5-fluoro-phenoxy)...)
Show SMILES NC(=O)CCCC(=O)N1CC2CC(=C(C(C1)N2)C(=O)N(Cc1ccccc1Cl)C1CC1)c1ccc(CCCOc2cc(Cl)ccc2Br)cc1 |c:12,TLB:31:12:16:8.15.9,6:8:16:13.12.11,THB:17:13:16:8.15.9,(20.78,-8.86,;19.41,-8.14,;19.35,-6.6,;18.11,-8.96,;16.75,-8.25,;15.45,-9.07,;14.08,-8.36,;14.02,-6.82,;12.78,-9.18,;12.24,-10.65,;10.52,-10.31,;11,-8.86,;10.42,-7.98,;9.14,-7.97,;9.86,-9.47,;11.67,-9.8,;9.33,-10.94,;7.6,-7.91,;6.88,-6.55,;6.79,-9.21,;5.25,-9.16,;4.43,-10.46,;5.16,-11.81,;4.35,-13.12,;2.8,-13.07,;2.08,-11.7,;2.9,-10.4,;2.13,-9.07,;7.51,-10.58,;7.46,-12.11,;8.82,-11.39,;11.1,-7.21,;12.64,-7.21,;13.4,-5.87,;12.63,-4.54,;13.39,-3.2,;14.93,-3.19,;15.7,-1.86,;17.24,-1.85,;18,-.51,;19.55,-.52,;20.31,.82,;21.85,.82,;19.54,2.14,;17.99,2.13,;17.23,.8,;15.69,.79,;11.08,-4.55,;10.32,-5.88,)|
Show InChI InChI=1S/C38H41BrCl2N4O4/c39-31-17-14-27(40)19-34(31)49-18-4-5-24-10-12-25(13-11-24)30-20-28-22-44(36(47)9-3-8-35(42)46)23-33(43-28)37(30)38(48)45(29-15-16-29)21-26-6-1-2-7-32(26)41/h1-2,6-7,10-14,17,19,28-29,33,43H,3-5,8-9,15-16,18,20-23H2,(H2,42,46)
Reactome pathway
n/an/a 56n/an/an/an/an/an/a
Actelion Pharmaceuticals Ltd.
Curated by ChEMBL
Assay Description
Inhibition of human recombinant rennin in human plasma assessed as accumulation of angiotensin 1 using human tetradecapeptide by immunoassay
J Med Chem 52: 3689-702 (2009)
Article DOI: 10.1021/jm900022f
BindingDB Entry DOI: 10.7270/Q2PC3391