BDBM50259527 CHEMBL4070227
SMILES: CC[C@@H](CO)Nc1ccc2ncc(-c3cccc(\C=N\[C@@H](CC)CO)c3)n2n1
InChI Key: InChIKey=SZOYOCHRMSEEMG-AIHKSIKWSA-N
Data: 11 IC50
Activity Spreadsheet -- Enzyme Inhibition Constant Data from BindingDB
Found 11 hits for monomerid = 50259527
Trg + Lig
Ki
nM
ΔG°
kcal/mole
IC50
nM
Kd
nM
EC50/IC50
nM
koff
s-1
kon
M-1s-1
pHTemp
°C
Dual-specificity tyrosine-phosphorylation regulated kinase 2
(Homo sapiens (Human))
BDBM50259527
(CHEMBL4070227)
Show SMILES CC[C@@H](CO)Nc1ccc2ncc(-c3cccc(\C=N\[C@@H](CC)CO)c3)n2n1 |r|
Show InChI InChI=1S/C21H27N5O2/c1-3-17(13-27)22-11-15-6-5-7-16(10-15)19-12-23-21-9-8-20(25-26(19)21)24-18(4-2)14-28/h5-12,17-18,27-28H,3-4,13-14H2,1-2H3,(H,24,25)/b22-11+/t17-,18-/m0/s1
NCI pathway
n/an/a 500n/an/an/an/an/an/a
ManRos Therapeutics, Perharidy Research Center, 29680 Roscoff, Bretagne, France; Unité de Technologies Chimiques et Biologiques pour la Santé, Université Paris Descartes, UMR-S 1022 Inserm, 4 avenue
Curated by ChEMBL
Assay Description
Inhibition of GST tagged recombinant human DYRK2 expressed in Escherichia coli using using woodtide as substrate after 30 mins by [gamma-33P]ATP base...
Eur J Med Chem 125: 696-709 (2017)
Article DOI: 10.1016/j.ejmech.2016.09.064
BindingDB Entry DOI: 10.7270/Q2M61NPG
Dual specificity protein kinase CLK2
(Mus musculus)
BDBM50259527
(CHEMBL4070227)
Show SMILES CC[C@@H](CO)Nc1ccc2ncc(-c3cccc(\C=N\[C@@H](CC)CO)c3)n2n1 |r|
Show InChI InChI=1S/C21H27N5O2/c1-3-17(13-27)22-11-15-6-5-7-16(10-15)19-12-23-21-9-8-20(25-26(19)21)24-18(4-2)14-28/h5-12,17-18,27-28H,3-4,13-14H2,1-2H3,(H,24,25)/b22-11+/t17-,18-/m0/s1
n/an/a 160n/an/an/an/an/an/a
ManRos Therapeutics, Perharidy Research Center, 29680 Roscoff, Bretagne, France; Unité de Technologies Chimiques et Biologiques pour la Santé, Université Paris Descartes, UMR-S 1022 Inserm, 4 avenue
Curated by ChEMBL
Assay Description
Inhibition of GST tagged recombinant mouse CLK2 expressed in Escherichia coli using RS peptide as substrate after 30 mins by [gamma-33P]ATP based sci...
Eur J Med Chem 125: 696-709 (2017)
Article DOI: 10.1016/j.ejmech.2016.09.064
BindingDB Entry DOI: 10.7270/Q2M61NPG
Dual-specificity tyrosine-phosphorylation regulated kinase 1A
(Homo sapiens (Human))
BDBM50259527
(CHEMBL4070227)
Show SMILES CC[C@@H](CO)Nc1ccc2ncc(-c3cccc(\C=N\[C@@H](CC)CO)c3)n2n1 |r|
Show InChI InChI=1S/C21H27N5O2/c1-3-17(13-27)22-11-15-6-5-7-16(10-15)19-12-23-21-9-8-20(25-26(19)21)24-18(4-2)14-28/h5-12,17-18,27-28H,3-4,13-14H2,1-2H3,(H,24,25)/b22-11+/t17-,18-/m0/s1
Reactome pathway
n/an/a 120n/an/an/an/an/an/a
ManRos Therapeutics, Perharidy Research Center, 29680 Roscoff, Bretagne, France; Unité de Technologies Chimiques et Biologiques pour la Santé, Université Paris Descartes, UMR-S 1022 Inserm, 4 avenue
Curated by ChEMBL
Assay Description
Inhibition of GST tagged recombinant human DYRK1A expressed in Escherichia coli using woodtide as substrate after 30 mins by [gamma-33P]ATP based sci...
Eur J Med Chem 125: 696-709 (2017)
Article DOI: 10.1016/j.ejmech.2016.09.064
BindingDB Entry DOI: 10.7270/Q2M61NPG
Dual specificity tyrosine-phosphorylation-regulated kinase 1B
(Homo sapiens (Human))
BDBM50259527
(CHEMBL4070227)
Show SMILES CC[C@@H](CO)Nc1ccc2ncc(-c3cccc(\C=N\[C@@H](CC)CO)c3)n2n1 |r|
Show InChI InChI=1S/C21H27N5O2/c1-3-17(13-27)22-11-15-6-5-7-16(10-15)19-12-23-21-9-8-20(25-26(19)21)24-18(4-2)14-28/h5-12,17-18,27-28H,3-4,13-14H2,1-2H3,(H,24,25)/b22-11+/t17-,18-/m0/s1
n/an/a 110n/an/an/an/an/an/a
ManRos Therapeutics, Perharidy Research Center, 29680 Roscoff, Bretagne, France; Unité de Technologies Chimiques et Biologiques pour la Santé, Université Paris Descartes, UMR-S 1022 Inserm, 4 avenue
Curated by ChEMBL
Assay Description
Inhibitory concentration against thrombin (FIIa); n=2
Eur J Med Chem 125: 696-709 (2017)
Article DOI: 10.1016/j.ejmech.2016.09.064
BindingDB Entry DOI: 10.7270/Q2M61NPG
Dual specificity protein kinase CLK3
(Mus musculus)
BDBM50259527
(CHEMBL4070227)
Show SMILES CC[C@@H](CO)Nc1ccc2ncc(-c3cccc(\C=N\[C@@H](CC)CO)c3)n2n1 |r|
Show InChI InChI=1S/C21H27N5O2/c1-3-17(13-27)22-11-15-6-5-7-16(10-15)19-12-23-21-9-8-20(25-26(19)21)24-18(4-2)14-28/h5-12,17-18,27-28H,3-4,13-14H2,1-2H3,(H,24,25)/b22-11+/t17-,18-/m0/s1
n/an/a 1.90E+3n/an/an/an/an/an/a
ManRos Therapeutics, Perharidy Research Center, 29680 Roscoff, Bretagne, France; Unité de Technologies Chimiques et Biologiques pour la Santé, Université Paris Descartes, UMR-S 1022 Inserm, 4 avenue
Curated by ChEMBL
Assay Description
Inhibition of GST tagged recombinant mouse CLK3 expressed in Escherichia coli using RS peptide as substrate after 30 mins by [gamma-33P]ATP based sci...
Eur J Med Chem 125: 696-709 (2017)
Article DOI: 10.1016/j.ejmech.2016.09.064
BindingDB Entry DOI: 10.7270/Q2M61NPG
Cyclin-Dependent Kinase 2 (CDK2)
(Homo sapiens (Human))
BDBM50259527
(CHEMBL4070227)
Show SMILES CC[C@@H](CO)Nc1ccc2ncc(-c3cccc(\C=N\[C@@H](CC)CO)c3)n2n1 |r|
Show InChI InChI=1S/C21H27N5O2/c1-3-17(13-27)22-11-15-6-5-7-16(10-15)19-12-23-21-9-8-20(25-26(19)21)24-18(4-2)14-28/h5-12,17-18,27-28H,3-4,13-14H2,1-2H3,(H,24,25)/b22-11+/t17-,18-/m0/s1
NCI pathway
Reactome pathway
n/an/a 1.20E+3n/an/an/an/an/an/a
ManRos Therapeutics, Perharidy Research Center, 29680 Roscoff, Bretagne, France; Unité de Technologies Chimiques et Biologiques pour la Santé, Université Paris Descartes, UMR-S 1022 Inserm, 4 avenue
Curated by ChEMBL
Assay Description
Binding affinity for dopamine D4 receptor was determined using NIMH DPSP radioligand
Eur J Med Chem 125: 696-709 (2017)
Article DOI: 10.1016/j.ejmech.2016.09.064
BindingDB Entry DOI: 10.7270/Q2M61NPG
Dual specificity protein kinase CLK1
(Mus musculus)
BDBM50259527
(CHEMBL4070227)
Show SMILES CC[C@@H](CO)Nc1ccc2ncc(-c3cccc(\C=N\[C@@H](CC)CO)c3)n2n1 |r|
Show InChI InChI=1S/C21H27N5O2/c1-3-17(13-27)22-11-15-6-5-7-16(10-15)19-12-23-21-9-8-20(25-26(19)21)24-18(4-2)14-28/h5-12,17-18,27-28H,3-4,13-14H2,1-2H3,(H,24,25)/b22-11+/t17-,18-/m0/s1
n/an/a 66n/an/an/an/an/an/a
ManRos Therapeutics, Perharidy Research Center, 29680 Roscoff, Bretagne, France; Unité de Technologies Chimiques et Biologiques pour la Santé, Université Paris Descartes, UMR-S 1022 Inserm, 4 avenue
Curated by ChEMBL
Assay Description
Inhibition of GST tagged recombinant mouse CLK1 expressed in Escherichia coli using RS peptide as substrate after 30 mins by [gamma-33P]ATP based sci...
Eur J Med Chem 125: 696-709 (2017)
Article DOI: 10.1016/j.ejmech.2016.09.064
BindingDB Entry DOI: 10.7270/Q2M61NPG
Dual specificity protein kinase CLK4
(Mus musculus)
BDBM50259527
(CHEMBL4070227)
Show SMILES CC[C@@H](CO)Nc1ccc2ncc(-c3cccc(\C=N\[C@@H](CC)CO)c3)n2n1 |r|
Show InChI InChI=1S/C21H27N5O2/c1-3-17(13-27)22-11-15-6-5-7-16(10-15)19-12-23-21-9-8-20(25-26(19)21)24-18(4-2)14-28/h5-12,17-18,27-28H,3-4,13-14H2,1-2H3,(H,24,25)/b22-11+/t17-,18-/m0/s1
n/an/a 42n/an/an/an/an/an/a
ManRos Therapeutics, Perharidy Research Center, 29680 Roscoff, Bretagne, France; Unité de Technologies Chimiques et Biologiques pour la Santé, Université Paris Descartes, UMR-S 1022 Inserm, 4 avenue
Curated by ChEMBL
Assay Description
Inhibition of GST tagged recombinant mouse CLK4 expressed in Escherichia coli using RS peptide as substrate after 30 mins by [gamma-33P]ATP based sci...
Eur J Med Chem 125: 696-709 (2017)
Article DOI: 10.1016/j.ejmech.2016.09.064
BindingDB Entry DOI: 10.7270/Q2M61NPG
Cyclin-Dependent Kinase 9 (CDK9)
(Homo sapiens (Human))
BDBM50259527
(CHEMBL4070227)
Show SMILES CC[C@@H](CO)Nc1ccc2ncc(-c3cccc(\C=N\[C@@H](CC)CO)c3)n2n1 |r|
Show InChI InChI=1S/C21H27N5O2/c1-3-17(13-27)22-11-15-6-5-7-16(10-15)19-12-23-21-9-8-20(25-26(19)21)24-18(4-2)14-28/h5-12,17-18,27-28H,3-4,13-14H2,1-2H3,(H,24,25)/b22-11+/t17-,18-/m0/s1
Reactome pathway
n/an/a 900n/an/an/an/an/an/a
ManRos Therapeutics, Perharidy Research Center, 29680 Roscoff, Bretagne, France; Unité de Technologies Chimiques et Biologiques pour la Santé, Université Paris Descartes, UMR-S 1022 Inserm, 4 avenue
Curated by ChEMBL
Assay Description
Inhibition of human recombinant CDK9/cyclin T expressed in insect cells using CDK7/9-tide as substrate after 30 mins by [gamma-33P]ATP based scintill...
Eur J Med Chem 125: 696-709 (2017)
Article DOI: 10.1016/j.ejmech.2016.09.064
BindingDB Entry DOI: 10.7270/Q2M61NPG
Cyclin-Dependent Kinase 5 (CDK5)
(Homo sapiens (Human))
BDBM50259527
(CHEMBL4070227)
Show SMILES CC[C@@H](CO)Nc1ccc2ncc(-c3cccc(\C=N\[C@@H](CC)CO)c3)n2n1 |r|
Show InChI InChI=1S/C21H27N5O2/c1-3-17(13-27)22-11-15-6-5-7-16(10-15)19-12-23-21-9-8-20(25-26(19)21)24-18(4-2)14-28/h5-12,17-18,27-28H,3-4,13-14H2,1-2H3,(H,24,25)/b22-11+/t17-,18-/m0/s1
NCI pathway
Reactome pathway
n/an/a 590n/an/an/an/an/an/a
ManRos Therapeutics, Perharidy Research Center, 29680 Roscoff, Bretagne, France; Unité de Technologies Chimiques et Biologiques pour la Santé, Université Paris Descartes, UMR-S 1022 Inserm, 4 avenue
Curated by ChEMBL
Assay Description
Inhibition of human recombinant CDK5/p25 after 30 mins by [gamma-33P]ATP based scintillation counting analysis
Eur J Med Chem 125: 696-709 (2017)
Article DOI: 10.1016/j.ejmech.2016.09.064
BindingDB Entry DOI: 10.7270/Q2M61NPG
Dual-specificity tyrosine-phosphorylation regulated kinase 3
(Homo sapiens (Human))
BDBM50259527
(CHEMBL4070227)
Show SMILES CC[C@@H](CO)Nc1ccc2ncc(-c3cccc(\C=N\[C@@H](CC)CO)c3)n2n1 |r|
Show InChI InChI=1S/C21H27N5O2/c1-3-17(13-27)22-11-15-6-5-7-16(10-15)19-12-23-21-9-8-20(25-26(19)21)24-18(4-2)14-28/h5-12,17-18,27-28H,3-4,13-14H2,1-2H3,(H,24,25)/b22-11+/t17-,18-/m0/s1
n/an/a 1.40E+3n/an/an/an/an/an/a
ManRos Therapeutics, Perharidy Research Center, 29680 Roscoff, Bretagne, France; Unité de Technologies Chimiques et Biologiques pour la Santé, Université Paris Descartes, UMR-S 1022 Inserm, 4 avenue
Curated by ChEMBL
Assay Description
Inhibition of GST tagged recombinant human DYRK3 expressed in Escherichia coli using woodtide as substrate after 30 mins by [gamma-33P]ATP based scin...
Eur J Med Chem 125: 696-709 (2017)
Article DOI: 10.1016/j.ejmech.2016.09.064
BindingDB Entry DOI: 10.7270/Q2M61NPG