BDBM50260173 CHEMBL4095576
SMILES: [H][C@@]1(C[C@@H]([C@H](C[C@@H]1OC)C(=O)OC)C(=O)OC)O[C@H]1O[C@H](CO)[C@@H](O)[C@H](O)[C@@H]1O
InChI Key: InChIKey=MUXOGVAKSFELPI-CIIYRDNMSA-N
Data: 1 IC50
Activity Spreadsheet -- Enzyme Inhibition Constant Data from BindingDB
Found 1 hit for monomerid = 50260173
Trg + Lig
Ki
nM
ΔG°
kcal/mole
IC50
nM
Kd
nM
EC50/IC50
nM
koff
s-1
kon
M-1s-1
pHTemp
°C
CD209 antigen
(Homo sapiens (Human))
BDBM50260173
(CHEMBL4095576)
Show SMILES [H][C@@]1(C[C@@H]([C@H](C[C@@H]1OC)C(=O)OC)C(=O)OC)O[C@H]1O[C@H](CO)[C@@H](O)[C@H](O)[C@@H]1O |r|
Show InChI InChI=1S/C17H28O11/c1-24-9-4-7(15(22)25-2)8(16(23)26-3)5-10(9)27-17-14(21)13(20)12(19)11(6-18)28-17/h7-14,17-21H,4-6H2,1-3H3/t7-,8-,9-,10-,11+,12+,13-,14-,17-/m0/s1
n/an/a 7.20E+5n/an/an/an/an/an/a
Universita' degli Studi di Milano
Curated by ChEMBL
Assay Description
Displacement of [3H]R-1881 from Androgen receptor of PC3-AR cells
Bioorg Med Chem 25: 5142-5147 (2017)
Article DOI: 10.1016/j.bmc.2017.03.046
BindingDB Entry DOI: 10.7270/Q2319ZBC