BDBM50260476 CHEMBL4093268
SMILES: CN1C=CC(C=C1)C1NC(=CN1c1ccc(cc1)S(N)(=O)=O)C(F)(F)F
InChI Key: InChIKey=HPDDWVAJCJTSJT-UHFFFAOYSA-N
Data: 2 IC50
Activity Spreadsheet -- Enzyme Inhibition Constant Data from BindingDB
Found 2 hits for monomerid = 50260476
Trg + Lig
Ki
nM
ΔG°
kcal/mole
IC50
nM
Kd
nM
EC50/IC50
nM
koff
s-1
kon
M-1s-1
pHTemp
°C
Cyclooxygenase
(RAT)
BDBM50260476
(CHEMBL4093268)
Show SMILES CN1C=CC(C=C1)C1NC(=CN1c1ccc(cc1)S(N)(=O)=O)C(F)(F)F |c:2,5,10|
Show InChI InChI=1S/C16H17F3N4O2S/c1-22-8-6-11(7-9-22)15-21-14(16(17,18)19)10-23(15)12-2-4-13(5-3-12)26(20,24)25/h2-11,15,21H,1H3,(H2,20,24,25)
Reactome pathway
n/an/a 1.80n/an/an/an/an/an/a
Chongqing Normal University
Curated by ChEMBL
Assay Description
Inhibition of COX-2 in rat peritoneal macrophages assessed as reduction in PGE2 production using radiolabelled-arachidonic acid as substrate pretreat...
Bioorg Med Chem 25: 4887-4893 (2017)
Article DOI: 10.1016/j.bmc.2017.07.038
BindingDB Entry DOI: 10.7270/Q2KW5JGN
Cyclooxygenase
(RAT)
BDBM50260476
(CHEMBL4093268)
Show SMILES CN1C=CC(C=C1)C1NC(=CN1c1ccc(cc1)S(N)(=O)=O)C(F)(F)F |c:2,5,10|
Show InChI InChI=1S/C16H17F3N4O2S/c1-22-8-6-11(7-9-22)15-21-14(16(17,18)19)10-23(15)12-2-4-13(5-3-12)26(20,24)25/h2-11,15,21H,1H3,(H2,20,24,25)
n/an/a 70n/an/an/an/an/an/a
Chongqing Normal University
Curated by ChEMBL
Assay Description
Inhibition of COX-1 in rat peritoneal macrophages assessed as reduction in [125I]-6-Keto-PGF1alpha production using arachidonic acid as substrate pre...
Bioorg Med Chem 25: 4887-4893 (2017)
Article DOI: 10.1016/j.bmc.2017.07.038
BindingDB Entry DOI: 10.7270/Q2KW5JGN