BDBM50262448 (+/-) N-(4-(3-(2-chloro-4-fluorophenyl)-1,2,4-oxadiazol-5-yl)butan-2-yl)quinolin-3-amine::CHEMBL477994
SMILES: CC(CCc1nc(no1)-c1ccc(F)cc1Cl)Nc1cnc2ccccc2c1
InChI Key: InChIKey=XHOOXTMFAABYSL-UHFFFAOYSA-N
Data: 2 EC50
Activity Spreadsheet -- Enzyme Inhibition Constant Data from BindingDB
Found 2 hits for monomerid = 50262448
Trg + Lig
Ki
nM
ΔG°
kcal/mole
IC50
nM
Kd
nM
EC50/IC50
nM
koff
s-1
kon
M-1s-1
pHTemp
°C
Cannabinoid receptor 2
(Homo sapiens (Human))
BDBM50262448
((+/-) N-(4-(3-(2-chloro-4-fluorophenyl)-1,2,4-oxad...)
Show SMILES CC(CCc1nc(no1)-c1ccc(F)cc1Cl)Nc1cnc2ccccc2c1
Show InChI InChI=1S/C21H18ClFN4O/c1-13(25-16-10-14-4-2-3-5-19(14)24-12-16)6-9-20-26-21(27-28-20)17-8-7-15(23)11-18(17)22/h2-5,7-8,10-13,25H,6,9H2,1H3
Reactome pathway
n/an/an/an/a 15n/an/an/an/a
Amgen Inc.
Curated by ChEMBL
Assay Description
Agonist activity at human CB2 receptor expressed in insect Sf9 cells assessed as effect on Eu-GTP binding
Bioorg Med Chem Lett 18: 4267-74 (2008)
Article DOI: 10.1016/j.bmcl.2008.06.096
BindingDB Entry DOI: 10.7270/Q21C1WQ8
Cannabinoid receptor 1
(Homo sapiens (Human))
BDBM50262448
((+/-) N-(4-(3-(2-chloro-4-fluorophenyl)-1,2,4-oxad...)
Show SMILES CC(CCc1nc(no1)-c1ccc(F)cc1Cl)Nc1cnc2ccccc2c1
Show InChI InChI=1S/C21H18ClFN4O/c1-13(25-16-10-14-4-2-3-5-19(14)24-12-16)6-9-20-26-21(27-28-20)17-8-7-15(23)11-18(17)22/h2-5,7-8,10-13,25H,6,9H2,1H3
NCI pathway
Reactome pathway
n/an/an/an/a 1.56E+3n/an/an/an/a
Amgen Inc.
Curated by ChEMBL
Assay Description
Agonist activity at human CB1 receptor expressed in insect Sf9 cells assessed as effect on Eu-GTP binding
Bioorg Med Chem Lett 18: 4267-74 (2008)
Article DOI: 10.1016/j.bmcl.2008.06.096
BindingDB Entry DOI: 10.7270/Q21C1WQ8