BDBM50263381 CHEMBL4097903
SMILES: CC[C@H](C)[C@@H]1NC(=O)[C@@H]2CCCN2[C@H]2CSSC[C@H](NC(=O)[C@@H]3CSSC[C@H](NC(=O)[C@H](CC(N)=O)NC(=O)[C@H](Cc4ccc(O)cc4)NC(=O)[C@H](Cc4cnc[nH]4)NC(=O)[C@@H](N)CC(O)=O)C(=O)N[C@@H](C(C)C)C(=O)N[C@@H](CO)C(=O)N[C@@H](CO)C(=O)NCC(=O)NCC(=O)N[C@@H](CCC(O)=O)C(=O)N[C@@H](CSSC[C@H](NC(=O)[C@@H](NC(=O)CNC(=O)[C@H](CCC(N)=O)NC(=O)[C@@H](NC(=O)[C@H](CCCCN)NC(=O)[C@@H](NC(=O)[C@H](Cc4ccccc4)NC1=O)[C@@H](C)O)[C@@H](C)CC)[C@@H](C)O)C(=O)N[C@@H](Cc1ccc(O)cc1)C(=O)N[C@@H](CCCNC(N)=N)C(=O)NCC(=O)N[C@@H](CCCCN)C(=O)N[C@@H](C)C(=O)N[C@@H](CCCCN)C(=O)N3)C(=O)N[C@@H](CC(C)C)C(=O)N[C@H](Cc1ccc(O)cc1)C(=O)N[C@@H](CO)C(=O)N[C@@H](C)C(=O)NC2=O)C(=O)N[C@@H](CCCCN)C(N)=O
InChI Key: InChIKey=CFQRWRHLWMZZET-MVXRHJEXSA-N
Data: 1 KI  1 IC50  4 EC50
Activity Spreadsheet -- Enzyme Inhibition Constant Data from BindingDB
Found 6 hits for monomerid = 50263381
Trg + Lig
Ki
nM
ΔG°
kcal/mole
IC50
nM
Kd
nM
EC50/IC50
nM
koff
s-1
kon
M-1s-1
pHTemp
°C
Melanocyte-stimulating hormone receptor
(Homo sapiens (Human))
BDBM50263381
(CHEMBL4097903)
Show SMILES CC[C@H](C)[C@@H]1NC(=O)[C@@H]2CCCN2[C@H]2CSSC[C@H](NC(=O)[C@@H]3CSSC[C@H](NC(=O)[C@H](CC(N)=O)NC(=O)[C@H](Cc4ccc(O)cc4)NC(=O)[C@H](Cc4cnc[nH]4)NC(=O)[C@@H](N)CC(O)=O)C(=O)N[C@@H](C(C)C)C(=O)N[C@@H](CO)C(=O)N[C@@H](CO)C(=O)NCC(=O)NCC(=O)N[C@@H](CCC(O)=O)C(=O)N[C@@H](CSSC[C@H](NC(=O)[C@@H](NC(=O)CNC(=O)[C@H](CCC(N)=O)NC(=O)[C@@H](NC(=O)[C@H](CCCCN)NC(=O)[C@@H](NC(=O)[C@H](Cc4ccccc4)NC1=O)[C@@H](C)O)[C@@H](C)CC)[C@@H](C)O)C(=O)N[C@@H](Cc1ccc(O)cc1)C(=O)N[C@@H](CCCNC(N)=N)C(=O)NCC(=O)N[C@@H](CCCCN)C(=O)N[C@@H](C)C(=O)N[C@@H](CCCCN)C(=O)N3)C(=O)N[C@@H](CC(C)C)C(=O)N[C@H](Cc1ccc(O)cc1)C(=O)N[C@@H](CO)C(=O)N[C@@H](C)C(=O)NC2=O)C(=O)N[C@@H](CCCCN)C(N)=O |r|
Show InChI InChI=1S/C167H256N48O50S6/c1-13-83(7)131-163(262)193-103(48-50-122(173)224)140(239)183-70-127(229)209-133(87(11)219)165(264)208-118-77-268-266-74-116-156(255)195-105(58-81(3)4)146(245)196-108(62-92-40-46-96(223)47-41-92)149(248)202-113(72-217)153(252)186-86(10)137(236)214-161(260)121(215-57-27-35-120(215)160(259)212-132(84(8)14-2)164(263)200-109(59-89-28-16-15-17-29-89)152(251)213-134(88(12)220)166(265)192-102(145(244)211-131)33-21-25-55-171)79-271-270-76-115(155(254)189-98(135(175)234)30-18-22-52-168)207-158(257)117(204-143(242)101(32-20-24-54-170)190-136(235)85(9)185-142(241)100(31-19-23-53-169)187-126(228)69-182-139(238)99(34-26-56-179-167(176)177)191-147(246)106(198-157(118)256)60-90-36-42-94(221)43-37-90)75-267-269-78-119(159(258)210-130(82(5)6)162(261)203-114(73-218)154(253)201-112(71-216)141(240)181-67-124(226)180-68-125(227)188-104(144(243)205-116)49-51-128(230)231)206-151(250)111(65-123(174)225)199-148(247)107(61-91-38-44-95(222)45-39-91)197-150(249)110(63-93-66-178-80-184-93)194-138(237)97(172)64-129(232)233/h15-17,28-29,36-47,66,80-88,97-121,130-134,216-223H,13-14,18-27,30-35,48-65,67-79,168-172H2,1-12H3,(H2,173,224)(H2,174,225)(H2,175,234)(H,178,184)(H,180,226)(H,181,240)(H,182,238)(H,183,239)(H,185,241)(H,186,252)(H,187,228)(H,188,227)(H,189,254)(H,190,235)(H,191,246)(H,192,265)(H,193,262)(H,194,237)(H,195,255)(H,196,245)(H,197,249)(H,198,256)(H,199,247)(H,200,263)(H,201,253)(H,202,248)(H,203,261)(H,204,242)(H,205,243)(H,206,250)(H,207,257)(H,208,264)(H,209,229)(H,210,258)(H,211,244)(H,212,259)(H,213,251)(H,230,231)(H,232,233)(H4,176,177,179)(H,214,236,260)/t83-,84-,85-,86-,87+,88+,97-,98-,99-,100-,101-,102-,103-,104-,105-,106-,107-,108+,109-,110-,111-,112-,113-,114-,115-,116-,117-,118-,119-,120-,121-,130-,131-,132-,133-,134-/m0/s1
30n/an/an/an/an/an/an/an/a
Departments of Medicinal Chemistry and Pharmacodynamics , University of Florida , Gainesville , Florida 32610 , United States.
Curated by ChEMBL
Assay Description
Displacement of Eu-NDP-MSH from human MC1R expressed in HEK293T cells after 2 hrs by DELFIA method
J Med Chem 61: 3738-3744 (2018)
Article DOI: 10.1021/acs.jmedchem.8b00251
BindingDB Entry DOI: 10.7270/Q2CV4M69
Melanocortin receptor (M1 and M4)
(Homo sapiens (Human))
BDBM50263381
(CHEMBL4097903)
Show SMILES CC[C@H](C)[C@@H]1NC(=O)[C@@H]2CCCN2[C@H]2CSSC[C@H](NC(=O)[C@@H]3CSSC[C@H](NC(=O)[C@H](CC(N)=O)NC(=O)[C@H](Cc4ccc(O)cc4)NC(=O)[C@H](Cc4cnc[nH]4)NC(=O)[C@@H](N)CC(O)=O)C(=O)N[C@@H](C(C)C)C(=O)N[C@@H](CO)C(=O)N[C@@H](CO)C(=O)NCC(=O)NCC(=O)N[C@@H](CCC(O)=O)C(=O)N[C@@H](CSSC[C@H](NC(=O)[C@@H](NC(=O)CNC(=O)[C@H](CCC(N)=O)NC(=O)[C@@H](NC(=O)[C@H](CCCCN)NC(=O)[C@@H](NC(=O)[C@H](Cc4ccccc4)NC1=O)[C@@H](C)O)[C@@H](C)CC)[C@@H](C)O)C(=O)N[C@@H](Cc1ccc(O)cc1)C(=O)N[C@@H](CCCNC(N)=N)C(=O)NCC(=O)N[C@@H](CCCCN)C(=O)N[C@@H](C)C(=O)N[C@@H](CCCCN)C(=O)N3)C(=O)N[C@@H](CC(C)C)C(=O)N[C@H](Cc1ccc(O)cc1)C(=O)N[C@@H](CO)C(=O)N[C@@H](C)C(=O)NC2=O)C(=O)N[C@@H](CCCCN)C(N)=O |r|
Show InChI InChI=1S/C167H256N48O50S6/c1-13-83(7)131-163(262)193-103(48-50-122(173)224)140(239)183-70-127(229)209-133(87(11)219)165(264)208-118-77-268-266-74-116-156(255)195-105(58-81(3)4)146(245)196-108(62-92-40-46-96(223)47-41-92)149(248)202-113(72-217)153(252)186-86(10)137(236)214-161(260)121(215-57-27-35-120(215)160(259)212-132(84(8)14-2)164(263)200-109(59-89-28-16-15-17-29-89)152(251)213-134(88(12)220)166(265)192-102(145(244)211-131)33-21-25-55-171)79-271-270-76-115(155(254)189-98(135(175)234)30-18-22-52-168)207-158(257)117(204-143(242)101(32-20-24-54-170)190-136(235)85(9)185-142(241)100(31-19-23-53-169)187-126(228)69-182-139(238)99(34-26-56-179-167(176)177)191-147(246)106(198-157(118)256)60-90-36-42-94(221)43-37-90)75-267-269-78-119(159(258)210-130(82(5)6)162(261)203-114(73-218)154(253)201-112(71-216)141(240)181-67-124(226)180-68-125(227)188-104(144(243)205-116)49-51-128(230)231)206-151(250)111(65-123(174)225)199-148(247)107(61-91-38-44-95(222)45-39-91)197-150(249)110(63-93-66-178-80-184-93)194-138(237)97(172)64-129(232)233/h15-17,28-29,36-47,66,80-88,97-121,130-134,216-223H,13-14,18-27,30-35,48-65,67-79,168-172H2,1-12H3,(H2,173,224)(H2,174,225)(H2,175,234)(H,178,184)(H,180,226)(H,181,240)(H,182,238)(H,183,239)(H,185,241)(H,186,252)(H,187,228)(H,188,227)(H,189,254)(H,190,235)(H,191,246)(H,192,265)(H,193,262)(H,194,237)(H,195,255)(H,196,245)(H,197,249)(H,198,256)(H,199,247)(H,200,263)(H,201,253)(H,202,248)(H,203,261)(H,204,242)(H,205,243)(H,206,250)(H,207,257)(H,208,264)(H,209,229)(H,210,258)(H,211,244)(H,212,259)(H,213,251)(H,230,231)(H,232,233)(H4,176,177,179)(H,214,236,260)/t83-,84-,85-,86-,87+,88+,97-,98-,99-,100-,101-,102-,103-,104-,105-,106-,107-,108+,109-,110-,111-,112-,113-,114-,115-,116-,117-,118-,119-,120-,121-,130-,131-,132-,133-,134-/m0/s1
n/an/an/an/a 7.40E+3n/an/an/an/a
Departments of Medicinal Chemistry and Pharmacodynamics , University of Florida , Gainesville , Florida 32610 , United States.
Curated by ChEMBL
Assay Description
Agonist activity at human MC1R expressed in HEK293 cells assessed as increase in cAMP production incubated for 2 hrs by AlphaScreen assay
J Med Chem 61: 3738-3744 (2018)
Article DOI: 10.1021/acs.jmedchem.8b00251
BindingDB Entry DOI: 10.7270/Q2CV4M69
Melanocortin receptor 3
(Homo sapiens (Human))
BDBM50263381
(CHEMBL4097903)
Show SMILES CC[C@H](C)[C@@H]1NC(=O)[C@@H]2CCCN2[C@H]2CSSC[C@H](NC(=O)[C@@H]3CSSC[C@H](NC(=O)[C@H](CC(N)=O)NC(=O)[C@H](Cc4ccc(O)cc4)NC(=O)[C@H](Cc4cnc[nH]4)NC(=O)[C@@H](N)CC(O)=O)C(=O)N[C@@H](C(C)C)C(=O)N[C@@H](CO)C(=O)N[C@@H](CO)C(=O)NCC(=O)NCC(=O)N[C@@H](CCC(O)=O)C(=O)N[C@@H](CSSC[C@H](NC(=O)[C@@H](NC(=O)CNC(=O)[C@H](CCC(N)=O)NC(=O)[C@@H](NC(=O)[C@H](CCCCN)NC(=O)[C@@H](NC(=O)[C@H](Cc4ccccc4)NC1=O)[C@@H](C)O)[C@@H](C)CC)[C@@H](C)O)C(=O)N[C@@H](Cc1ccc(O)cc1)C(=O)N[C@@H](CCCNC(N)=N)C(=O)NCC(=O)N[C@@H](CCCCN)C(=O)N[C@@H](C)C(=O)N[C@@H](CCCCN)C(=O)N3)C(=O)N[C@@H](CC(C)C)C(=O)N[C@H](Cc1ccc(O)cc1)C(=O)N[C@@H](CO)C(=O)N[C@@H](C)C(=O)NC2=O)C(=O)N[C@@H](CCCCN)C(N)=O |r|
Show InChI InChI=1S/C167H256N48O50S6/c1-13-83(7)131-163(262)193-103(48-50-122(173)224)140(239)183-70-127(229)209-133(87(11)219)165(264)208-118-77-268-266-74-116-156(255)195-105(58-81(3)4)146(245)196-108(62-92-40-46-96(223)47-41-92)149(248)202-113(72-217)153(252)186-86(10)137(236)214-161(260)121(215-57-27-35-120(215)160(259)212-132(84(8)14-2)164(263)200-109(59-89-28-16-15-17-29-89)152(251)213-134(88(12)220)166(265)192-102(145(244)211-131)33-21-25-55-171)79-271-270-76-115(155(254)189-98(135(175)234)30-18-22-52-168)207-158(257)117(204-143(242)101(32-20-24-54-170)190-136(235)85(9)185-142(241)100(31-19-23-53-169)187-126(228)69-182-139(238)99(34-26-56-179-167(176)177)191-147(246)106(198-157(118)256)60-90-36-42-94(221)43-37-90)75-267-269-78-119(159(258)210-130(82(5)6)162(261)203-114(73-218)154(253)201-112(71-216)141(240)181-67-124(226)180-68-125(227)188-104(144(243)205-116)49-51-128(230)231)206-151(250)111(65-123(174)225)199-148(247)107(61-91-38-44-95(222)45-39-91)197-150(249)110(63-93-66-178-80-184-93)194-138(237)97(172)64-129(232)233/h15-17,28-29,36-47,66,80-88,97-121,130-134,216-223H,13-14,18-27,30-35,48-65,67-79,168-172H2,1-12H3,(H2,173,224)(H2,174,225)(H2,175,234)(H,178,184)(H,180,226)(H,181,240)(H,182,238)(H,183,239)(H,185,241)(H,186,252)(H,187,228)(H,188,227)(H,189,254)(H,190,235)(H,191,246)(H,192,265)(H,193,262)(H,194,237)(H,195,255)(H,196,245)(H,197,249)(H,198,256)(H,199,247)(H,200,263)(H,201,253)(H,202,248)(H,203,261)(H,204,242)(H,205,243)(H,206,250)(H,207,257)(H,208,264)(H,209,229)(H,210,258)(H,211,244)(H,212,259)(H,213,251)(H,230,231)(H,232,233)(H4,176,177,179)(H,214,236,260)/t83-,84-,85-,86-,87+,88+,97-,98-,99-,100-,101-,102-,103-,104-,105-,106-,107-,108+,109-,110-,111-,112-,113-,114-,115-,116-,117-,118-,119-,120-,121-,130-,131-,132-,133-,134-/m0/s1
n/an/an/an/a>1.00E+5n/an/an/an/a
Departments of Medicinal Chemistry and Pharmacodynamics , University of Florida , Gainesville , Florida 32610 , United States.
Curated by ChEMBL
Assay Description
Agonist activity at human MC3R expressed in HEK293 cells assessed as increase in cAMP production incubated for 2 hrs by AlphaScreen assay
J Med Chem 61: 3738-3744 (2018)
Article DOI: 10.1021/acs.jmedchem.8b00251
BindingDB Entry DOI: 10.7270/Q2CV4M69
Melanocortin receptor (M1 and M4)
(Homo sapiens (Human))
BDBM50263381
(CHEMBL4097903)
Show SMILES CC[C@H](C)[C@@H]1NC(=O)[C@@H]2CCCN2[C@H]2CSSC[C@H](NC(=O)[C@@H]3CSSC[C@H](NC(=O)[C@H](CC(N)=O)NC(=O)[C@H](Cc4ccc(O)cc4)NC(=O)[C@H](Cc4cnc[nH]4)NC(=O)[C@@H](N)CC(O)=O)C(=O)N[C@@H](C(C)C)C(=O)N[C@@H](CO)C(=O)N[C@@H](CO)C(=O)NCC(=O)NCC(=O)N[C@@H](CCC(O)=O)C(=O)N[C@@H](CSSC[C@H](NC(=O)[C@@H](NC(=O)CNC(=O)[C@H](CCC(N)=O)NC(=O)[C@@H](NC(=O)[C@H](CCCCN)NC(=O)[C@@H](NC(=O)[C@H](Cc4ccccc4)NC1=O)[C@@H](C)O)[C@@H](C)CC)[C@@H](C)O)C(=O)N[C@@H](Cc1ccc(O)cc1)C(=O)N[C@@H](CCCNC(N)=N)C(=O)NCC(=O)N[C@@H](CCCCN)C(=O)N[C@@H](C)C(=O)N[C@@H](CCCCN)C(=O)N3)C(=O)N[C@@H](CC(C)C)C(=O)N[C@H](Cc1ccc(O)cc1)C(=O)N[C@@H](CO)C(=O)N[C@@H](C)C(=O)NC2=O)C(=O)N[C@@H](CCCCN)C(N)=O |r|
Show InChI InChI=1S/C167H256N48O50S6/c1-13-83(7)131-163(262)193-103(48-50-122(173)224)140(239)183-70-127(229)209-133(87(11)219)165(264)208-118-77-268-266-74-116-156(255)195-105(58-81(3)4)146(245)196-108(62-92-40-46-96(223)47-41-92)149(248)202-113(72-217)153(252)186-86(10)137(236)214-161(260)121(215-57-27-35-120(215)160(259)212-132(84(8)14-2)164(263)200-109(59-89-28-16-15-17-29-89)152(251)213-134(88(12)220)166(265)192-102(145(244)211-131)33-21-25-55-171)79-271-270-76-115(155(254)189-98(135(175)234)30-18-22-52-168)207-158(257)117(204-143(242)101(32-20-24-54-170)190-136(235)85(9)185-142(241)100(31-19-23-53-169)187-126(228)69-182-139(238)99(34-26-56-179-167(176)177)191-147(246)106(198-157(118)256)60-90-36-42-94(221)43-37-90)75-267-269-78-119(159(258)210-130(82(5)6)162(261)203-114(73-218)154(253)201-112(71-216)141(240)181-67-124(226)180-68-125(227)188-104(144(243)205-116)49-51-128(230)231)206-151(250)111(65-123(174)225)199-148(247)107(61-91-38-44-95(222)45-39-91)197-150(249)110(63-93-66-178-80-184-93)194-138(237)97(172)64-129(232)233/h15-17,28-29,36-47,66,80-88,97-121,130-134,216-223H,13-14,18-27,30-35,48-65,67-79,168-172H2,1-12H3,(H2,173,224)(H2,174,225)(H2,175,234)(H,178,184)(H,180,226)(H,181,240)(H,182,238)(H,183,239)(H,185,241)(H,186,252)(H,187,228)(H,188,227)(H,189,254)(H,190,235)(H,191,246)(H,192,265)(H,193,262)(H,194,237)(H,195,255)(H,196,245)(H,197,249)(H,198,256)(H,199,247)(H,200,263)(H,201,253)(H,202,248)(H,203,261)(H,204,242)(H,205,243)(H,206,250)(H,207,257)(H,208,264)(H,209,229)(H,210,258)(H,211,244)(H,212,259)(H,213,251)(H,230,231)(H,232,233)(H4,176,177,179)(H,214,236,260)/t83-,84-,85-,86-,87+,88+,97-,98-,99-,100-,101-,102-,103-,104-,105-,106-,107-,108+,109-,110-,111-,112-,113-,114-,115-,116-,117-,118-,119-,120-,121-,130-,131-,132-,133-,134-/m0/s1
n/an/a 2.60E+4n/an/an/an/an/an/a
Departments of Medicinal Chemistry and Pharmacodynamics , University of Florida , Gainesville , Florida 32610 , United States.
Curated by ChEMBL
Assay Description
Displacement of [125I]-NDP-MSH from human MC1R expressed in HEK293 cells
J Med Chem 61: 3738-3744 (2018)
Article DOI: 10.1021/acs.jmedchem.8b00251
BindingDB Entry DOI: 10.7270/Q2CV4M69
Melanocortin receptor 4
(Homo sapiens (Human))
BDBM50263381
(CHEMBL4097903)
Show SMILES CC[C@H](C)[C@@H]1NC(=O)[C@@H]2CCCN2[C@H]2CSSC[C@H](NC(=O)[C@@H]3CSSC[C@H](NC(=O)[C@H](CC(N)=O)NC(=O)[C@H](Cc4ccc(O)cc4)NC(=O)[C@H](Cc4cnc[nH]4)NC(=O)[C@@H](N)CC(O)=O)C(=O)N[C@@H](C(C)C)C(=O)N[C@@H](CO)C(=O)N[C@@H](CO)C(=O)NCC(=O)NCC(=O)N[C@@H](CCC(O)=O)C(=O)N[C@@H](CSSC[C@H](NC(=O)[C@@H](NC(=O)CNC(=O)[C@H](CCC(N)=O)NC(=O)[C@@H](NC(=O)[C@H](CCCCN)NC(=O)[C@@H](NC(=O)[C@H](Cc4ccccc4)NC1=O)[C@@H](C)O)[C@@H](C)CC)[C@@H](C)O)C(=O)N[C@@H](Cc1ccc(O)cc1)C(=O)N[C@@H](CCCNC(N)=N)C(=O)NCC(=O)N[C@@H](CCCCN)C(=O)N[C@@H](C)C(=O)N[C@@H](CCCCN)C(=O)N3)C(=O)N[C@@H](CC(C)C)C(=O)N[C@H](Cc1ccc(O)cc1)C(=O)N[C@@H](CO)C(=O)N[C@@H](C)C(=O)NC2=O)C(=O)N[C@@H](CCCCN)C(N)=O |r|
Show InChI InChI=1S/C167H256N48O50S6/c1-13-83(7)131-163(262)193-103(48-50-122(173)224)140(239)183-70-127(229)209-133(87(11)219)165(264)208-118-77-268-266-74-116-156(255)195-105(58-81(3)4)146(245)196-108(62-92-40-46-96(223)47-41-92)149(248)202-113(72-217)153(252)186-86(10)137(236)214-161(260)121(215-57-27-35-120(215)160(259)212-132(84(8)14-2)164(263)200-109(59-89-28-16-15-17-29-89)152(251)213-134(88(12)220)166(265)192-102(145(244)211-131)33-21-25-55-171)79-271-270-76-115(155(254)189-98(135(175)234)30-18-22-52-168)207-158(257)117(204-143(242)101(32-20-24-54-170)190-136(235)85(9)185-142(241)100(31-19-23-53-169)187-126(228)69-182-139(238)99(34-26-56-179-167(176)177)191-147(246)106(198-157(118)256)60-90-36-42-94(221)43-37-90)75-267-269-78-119(159(258)210-130(82(5)6)162(261)203-114(73-218)154(253)201-112(71-216)141(240)181-67-124(226)180-68-125(227)188-104(144(243)205-116)49-51-128(230)231)206-151(250)111(65-123(174)225)199-148(247)107(61-91-38-44-95(222)45-39-91)197-150(249)110(63-93-66-178-80-184-93)194-138(237)97(172)64-129(232)233/h15-17,28-29,36-47,66,80-88,97-121,130-134,216-223H,13-14,18-27,30-35,48-65,67-79,168-172H2,1-12H3,(H2,173,224)(H2,174,225)(H2,175,234)(H,178,184)(H,180,226)(H,181,240)(H,182,238)(H,183,239)(H,185,241)(H,186,252)(H,187,228)(H,188,227)(H,189,254)(H,190,235)(H,191,246)(H,192,265)(H,193,262)(H,194,237)(H,195,255)(H,196,245)(H,197,249)(H,198,256)(H,199,247)(H,200,263)(H,201,253)(H,202,248)(H,203,261)(H,204,242)(H,205,243)(H,206,250)(H,207,257)(H,208,264)(H,209,229)(H,210,258)(H,211,244)(H,212,259)(H,213,251)(H,230,231)(H,232,233)(H4,176,177,179)(H,214,236,260)/t83-,84-,85-,86-,87+,88+,97-,98-,99-,100-,101-,102-,103-,104-,105-,106-,107-,108+,109-,110-,111-,112-,113-,114-,115-,116-,117-,118-,119-,120-,121-,130-,131-,132-,133-,134-/m0/s1
n/an/an/an/a 2.10E+4n/an/an/an/a
Departments of Medicinal Chemistry and Pharmacodynamics , University of Florida , Gainesville , Florida 32610 , United States.
Curated by ChEMBL
Assay Description
Agonist activity at human MC4R expressed in HEK293 cells assessed as increase in cAMP production incubated for 2 hrs by AlphaScreen assay
J Med Chem 61: 3738-3744 (2018)
Article DOI: 10.1021/acs.jmedchem.8b00251
BindingDB Entry DOI: 10.7270/Q2CV4M69
Melanocortin receptor (M4 and M5)
(Homo sapiens (Human))
BDBM50263381
(CHEMBL4097903)
Show SMILES CC[C@H](C)[C@@H]1NC(=O)[C@@H]2CCCN2[C@H]2CSSC[C@H](NC(=O)[C@@H]3CSSC[C@H](NC(=O)[C@H](CC(N)=O)NC(=O)[C@H](Cc4ccc(O)cc4)NC(=O)[C@H](Cc4cnc[nH]4)NC(=O)[C@@H](N)CC(O)=O)C(=O)N[C@@H](C(C)C)C(=O)N[C@@H](CO)C(=O)N[C@@H](CO)C(=O)NCC(=O)NCC(=O)N[C@@H](CCC(O)=O)C(=O)N[C@@H](CSSC[C@H](NC(=O)[C@@H](NC(=O)CNC(=O)[C@H](CCC(N)=O)NC(=O)[C@@H](NC(=O)[C@H](CCCCN)NC(=O)[C@@H](NC(=O)[C@H](Cc4ccccc4)NC1=O)[C@@H](C)O)[C@@H](C)CC)[C@@H](C)O)C(=O)N[C@@H](Cc1ccc(O)cc1)C(=O)N[C@@H](CCCNC(N)=N)C(=O)NCC(=O)N[C@@H](CCCCN)C(=O)N[C@@H](C)C(=O)N[C@@H](CCCCN)C(=O)N3)C(=O)N[C@@H](CC(C)C)C(=O)N[C@H](Cc1ccc(O)cc1)C(=O)N[C@@H](CO)C(=O)N[C@@H](C)C(=O)NC2=O)C(=O)N[C@@H](CCCCN)C(N)=O |r|
Show InChI InChI=1S/C167H256N48O50S6/c1-13-83(7)131-163(262)193-103(48-50-122(173)224)140(239)183-70-127(229)209-133(87(11)219)165(264)208-118-77-268-266-74-116-156(255)195-105(58-81(3)4)146(245)196-108(62-92-40-46-96(223)47-41-92)149(248)202-113(72-217)153(252)186-86(10)137(236)214-161(260)121(215-57-27-35-120(215)160(259)212-132(84(8)14-2)164(263)200-109(59-89-28-16-15-17-29-89)152(251)213-134(88(12)220)166(265)192-102(145(244)211-131)33-21-25-55-171)79-271-270-76-115(155(254)189-98(135(175)234)30-18-22-52-168)207-158(257)117(204-143(242)101(32-20-24-54-170)190-136(235)85(9)185-142(241)100(31-19-23-53-169)187-126(228)69-182-139(238)99(34-26-56-179-167(176)177)191-147(246)106(198-157(118)256)60-90-36-42-94(221)43-37-90)75-267-269-78-119(159(258)210-130(82(5)6)162(261)203-114(73-218)154(253)201-112(71-216)141(240)181-67-124(226)180-68-125(227)188-104(144(243)205-116)49-51-128(230)231)206-151(250)111(65-123(174)225)199-148(247)107(61-91-38-44-95(222)45-39-91)197-150(249)110(63-93-66-178-80-184-93)194-138(237)97(172)64-129(232)233/h15-17,28-29,36-47,66,80-88,97-121,130-134,216-223H,13-14,18-27,30-35,48-65,67-79,168-172H2,1-12H3,(H2,173,224)(H2,174,225)(H2,175,234)(H,178,184)(H,180,226)(H,181,240)(H,182,238)(H,183,239)(H,185,241)(H,186,252)(H,187,228)(H,188,227)(H,189,254)(H,190,235)(H,191,246)(H,192,265)(H,193,262)(H,194,237)(H,195,255)(H,196,245)(H,197,249)(H,198,256)(H,199,247)(H,200,263)(H,201,253)(H,202,248)(H,203,261)(H,204,242)(H,205,243)(H,206,250)(H,207,257)(H,208,264)(H,209,229)(H,210,258)(H,211,244)(H,212,259)(H,213,251)(H,230,231)(H,232,233)(H4,176,177,179)(H,214,236,260)/t83-,84-,85-,86-,87+,88+,97-,98-,99-,100-,101-,102-,103-,104-,105-,106-,107-,108+,109-,110-,111-,112-,113-,114-,115-,116-,117-,118-,119-,120-,121-,130-,131-,132-,133-,134-/m0/s1
n/an/an/an/a>1.00E+5n/an/an/an/a
Departments of Medicinal Chemistry and Pharmacodynamics , University of Florida , Gainesville , Florida 32610 , United States.
Curated by ChEMBL
Assay Description
Agonist activity at human MC5R expressed in HEK293 cells assessed as increase in cAMP production incubated for 2 hrs by AlphaScreen assay
J Med Chem 61: 3738-3744 (2018)
Article DOI: 10.1021/acs.jmedchem.8b00251
BindingDB Entry DOI: 10.7270/Q2CV4M69