BDBM50266036 CHEMBL4092205
SMILES: OC(=O)CCn1c2cc(Cl)c(Cl)cc2oc1=O
InChI Key: InChIKey=MIGAKMWKMLYGJX-UHFFFAOYSA-N
Data: 2 IC50
PDB links: 2 PDB IDs match this monomer.
Activity Spreadsheet -- Enzyme Inhibition Constant Data from BindingDB
Found 2 hits for monomerid = 50266036
Trg + Lig
Ki
nM
ΔG°
kcal/mole
IC50
nM
Kd
nM
EC50/IC50
nM
koff
s-1
kon
M-1s-1
pHTemp
°C
Kynurenine 3-monooxygenase
(Homo sapiens (Human))
BDBM50266036
(CHEMBL4092205)
Show SMILES OC(=O)CCn1c2cc(Cl)c(Cl)cc2oc1=O
Show InChI InChI=1S/C10H7Cl2NO4/c11-5-3-7-8(4-6(5)12)17-10(16)13(7)2-1-9(14)15/h3-4H,1-2H2,(H,14,15)
Reactome pathway
n/an/a 2.00E+3n/an/an/an/an/an/a
GlaxoSmithKline
Curated by ChEMBL
Assay Description
Inhibition of full length human GST-tagged KMO expressed in baculovirus infected Sf9 insect cell membranes using kynurenine as substrate measured aft...
J Med Chem 60: 3383-3404 (2017)
Article DOI: 10.1021/acs.jmedchem.7b00055
BindingDB Entry DOI: 10.7270/Q26112SB
Kynurenine 3-monooxygenase
(Homo sapiens (Human))
BDBM50266036
(CHEMBL4092205)
Show SMILES OC(=O)CCn1c2cc(Cl)c(Cl)cc2oc1=O
Show InChI InChI=1S/C10H7Cl2NO4/c11-5-3-7-8(4-6(5)12)17-10(16)13(7)2-1-9(14)15/h3-4H,1-2H2,(H,14,15)
Reactome pathway
n/an/a 6.30n/an/an/an/an/an/a
GlaxoSmithKline
Curated by ChEMBL
Assay Description
Inhibition of full length human GST-tagged KMO expressed in baculovirus infected Sf9 insect cell membranes using kynurenine as substrate measured aft...
J Med Chem 60: 3383-3404 (2017)
Article DOI: 10.1021/acs.jmedchem.7b00055
BindingDB Entry DOI: 10.7270/Q26112SB