BDBM50268726 CHEMBL521709::Disodium 1-amino-4-(3-amino-4-sulfophenylamino)-9,10-dioxo-9,10-dihydroanthracene-2-sulfonate::sodium 1-amino-4-(3-amino-4-sulfophenylamino)-9,10-dioxo-9,10-dihydroanthracene-2-sulfonate
SMILES: Nc1cc(Nc2cc(c(N)c3C(=O)c4ccccc4C(=O)c23)S([O-])(=O)=O)ccc1S([O-])(=O)=O
InChI Key: InChIKey=ZOHPJXCEVYGLJT-UHFFFAOYSA-L
Data: 2 KI  2 IC50
Activity Spreadsheet -- Enzyme Inhibition Constant Data from BindingDB
Found 4 hits for monomerid = 50268726
Trg + Lig
Ki
nM
ΔG°
kcal/mole
IC50
nM
Kd
nM
EC50/IC50
nM
koff
s-1
kon
M-1s-1
pHTemp
°C
Purinergic receptor P2Y12
(Homo sapiens (Human))
BDBM50268726
(CHEMBL521709 | Disodium 1-amino-4-(3-amino-4-sulfo...)
Show SMILES Nc1cc(Nc2cc(c(N)c3C(=O)c4ccccc4C(=O)c23)S([O-])(=O)=O)ccc1S([O-])(=O)=O
Show InChI InChI=1S/C20H15N3O8S2/c21-12-7-9(5-6-14(12)32(26,27)28)23-13-8-15(33(29,30)31)18(22)17-16(13)19(24)10-3-1-2-4-11(10)20(17)25/h1-8,23H,21-22H2,(H,26,27,28)(H,29,30,31)/p-2
Reactome pathway
2.10E+3n/an/an/an/an/an/an/an/a
University of Bonn
Curated by ChEMBL
Assay Description
Displacement of [3H]PSB0413 from human platelet P2Y12 receptor
J Med Chem 52: 3784-93 (2009)
Article DOI: 10.1021/jm9003297
BindingDB Entry DOI: 10.7270/Q2NK3FZF
Ecto-5'-nucleotidase (e5'NT)
(Rattus norvegicus (Rat))
BDBM50268726
(CHEMBL521709 | Disodium 1-amino-4-(3-amino-4-sulfo...)
Show SMILES Nc1cc(Nc2cc(c(N)c3C(=O)c4ccccc4C(=O)c23)S([O-])(=O)=O)ccc1S([O-])(=O)=O
Show InChI InChI=1S/C20H15N3O8S2/c21-12-7-9(5-6-14(12)32(26,27)28)23-13-8-15(33(29,30)31)18(22)17-16(13)19(24)10-3-1-2-4-11(10)20(17)25/h1-8,23H,21-22H2,(H,26,27,28)(H,29,30,31)/p-2
2.52E+4n/an/an/an/an/an/an/an/a
University of Bonn
Curated by ChEMBL
Assay Description
Inhibition of rat ecto-5'-nucleotidase expressed in Sf9 cells by capillary electrophoresis method
J Med Chem 53: 2076-86 (2010)
Article DOI: 10.1021/jm901851t
BindingDB Entry DOI: 10.7270/Q2DZ097V
Purinergic, P2X2
(RAT)
BDBM50268726
(CHEMBL521709 | Disodium 1-amino-4-(3-amino-4-sulfo...)
Show SMILES Nc1cc(Nc2cc(c(N)c3C(=O)c4ccccc4C(=O)c23)S([O-])(=O)=O)ccc1S([O-])(=O)=O
Show InChI InChI=1S/C20H15N3O8S2/c21-12-7-9(5-6-14(12)32(26,27)28)23-13-8-15(33(29,30)31)18(22)17-16(13)19(24)10-3-1-2-4-11(10)20(17)25/h1-8,23H,21-22H2,(H,26,27,28)(H,29,30,31)/p-2
n/an/a 1.00E+3n/an/an/an/an/an/a
University of Bonn
Curated by ChEMBL
Assay Description
Antagonist activity against rat P2X2 receptor expressed in Xenopus laevis oocyte assessed as inhibition of alpha, beta-meATP-induced inward current b...
J Med Chem 54: 817-30 (2012)
Article DOI: 10.1021/jm1012193
BindingDB Entry DOI: 10.7270/Q2VH5PTG
P2X purinoceptor 4
(RAT)
BDBM50268726
(CHEMBL521709 | Disodium 1-amino-4-(3-amino-4-sulfo...)
Show SMILES Nc1cc(Nc2cc(c(N)c3C(=O)c4ccccc4C(=O)c23)S([O-])(=O)=O)ccc1S([O-])(=O)=O
Show InChI InChI=1S/C20H15N3O8S2/c21-12-7-9(5-6-14(12)32(26,27)28)23-13-8-15(33(29,30)31)18(22)17-16(13)19(24)10-3-1-2-4-11(10)20(17)25/h1-8,23H,21-22H2,(H,26,27,28)(H,29,30,31)/p-2
n/an/a>1.00E+4n/an/an/an/an/an/a
University of Bonn
Curated by ChEMBL
Assay Description
Antagonist activity against rat P2X4 receptor expressed in Xenopus laevis oocyte assessed as inhibition of alpha, beta-meATP-induced inward current b...
J Med Chem 54: 817-30 (2012)
Article DOI: 10.1021/jm1012193
BindingDB Entry DOI: 10.7270/Q2VH5PTG