BDBM50272427 6-Chloro-N-(3-(3-(2-chloro-4-fluorophenyl)-1,2,4-oxadiazol-5-yl)propyl)-N-methylquinolin-3-amine::CHEMBL526471
SMILES: CN(CCCc1nc(no1)-c1ccc(F)cc1Cl)c1ccc2ncc(Cl)cc2c1
InChI Key: InChIKey=UGLDNKJYOYMGST-UHFFFAOYSA-N
Data: 1 EC50
Activity Spreadsheet -- Enzyme Inhibition Constant Data from BindingDB
Found 1 hit for monomerid = 50272427
Trg + Lig
Ki
nM
ΔG°
kcal/mole
IC50
nM
Kd
nM
EC50/IC50
nM
koff
s-1
kon
M-1s-1
pHTemp
°C
Cannabinoid receptor 2
(Homo sapiens (Human))
BDBM50272427
(6-Chloro-N-(3-(3-(2-chloro-4-fluorophenyl)-1,2,4-o...)
Show SMILES CN(CCCc1nc(no1)-c1ccc(F)cc1Cl)c1ccc2ncc(Cl)cc2c1
Show InChI InChI=1S/C21H17Cl2FN4O/c1-28(16-5-7-19-13(10-16)9-14(22)12-25-19)8-2-3-20-26-21(27-29-20)17-6-4-15(24)11-18(17)23/h4-7,9-12H,2-3,8H2,1H3
Reactome pathway
n/an/an/an/a 110n/an/an/an/a
Amgen Inc.
Curated by ChEMBL
Assay Description
Agonist activity at human recombinant CB2 receptor expressed in Sf9 cells by GTP-europium binding assay
J Med Chem 51: 5019-34 (2008)
Article DOI: 10.1021/jm800463f
BindingDB Entry DOI: 10.7270/Q2W096VS