BDBM50274188 1-(4'-Acetyl-biphenyl-3-yl)-4-oxo-1,4-dihydro-[1,8]naphthyridine-3-carboxylic acid isopropylamide::CHEMBL519193
SMILES: CC(C)NC(=O)c1cn(-c2cccc(c2)-c2ccc(cc2)C(C)=O)c2ncccc2c1=O
InChI Key: InChIKey=XBGUWPHCZXONHE-UHFFFAOYSA-N
Data: 2 IC50
Activity Spreadsheet -- Enzyme Inhibition Constant Data from BindingDB
Found 2 hits for monomerid = 50274188
Trg + Lig
Ki
nM
ΔG°
kcal/mole
IC50
nM
Kd
nM
EC50/IC50
nM
koff
s-1
kon
M-1s-1
pHTemp
°C
Potassium voltage-gated channel subfamily H member 2
(Homo sapiens (Human))
BDBM50274188
(1-(4'-Acetyl-biphenyl-3-yl)-4-oxo-1,4-dihydro-[1,8...)
Show SMILES CC(C)NC(=O)c1cn(-c2cccc(c2)-c2ccc(cc2)C(C)=O)c2ncccc2c1=O
Show InChI InChI=1S/C26H23N3O3/c1-16(2)28-26(32)23-15-29(25-22(24(23)31)8-5-13-27-25)21-7-4-6-20(14-21)19-11-9-18(10-12-19)17(3)30/h4-16H,1-3H3,(H,28,32)
Reactome pathway
n/an/a 8.95E+3n/an/an/an/an/an/a
Merck Frosst Center for Therapeutic Research
Curated by ChEMBL
Assay Description
Displacement of [35S]MK-499 from human ERG expressed in HEK293 cells
Bioorg Med Chem Lett 18: 5554-8 (2008)
Article DOI: 10.1016/j.bmcl.2008.09.009
BindingDB Entry DOI: 10.7270/Q24X57M1
cAMP-specific 3',5'-cyclic phosphodiesterase 4A
(Homo sapiens (Human))
BDBM50274188
(1-(4'-Acetyl-biphenyl-3-yl)-4-oxo-1,4-dihydro-[1,8...)
Show SMILES CC(C)NC(=O)c1cn(-c2cccc(c2)-c2ccc(cc2)C(C)=O)c2ncccc2c1=O
Show InChI InChI=1S/C26H23N3O3/c1-16(2)28-26(32)23-15-29(25-22(24(23)31)8-5-13-27-25)21-7-4-6-20(14-21)19-11-9-18(10-12-19)17(3)30/h4-16H,1-3H3,(H,28,32)
n/an/a 0.340n/an/an/an/an/an/a
Merck Frosst Center for Therapeutic Research
Curated by ChEMBL
Assay Description
Intrinsic inhibition of GST-fused human PDE4A expressed in SF9 cells
Bioorg Med Chem Lett 18: 5554-8 (2008)
Article DOI: 10.1016/j.bmcl.2008.09.009
BindingDB Entry DOI: 10.7270/Q24X57M1