BDBM50277861 3-(4-(2-(5-methyl-2-phenyloxazol-4-yl)ethoxy)naphthalen-1-yl)-2-propoxypropanoic acid::CHEMBL519974
SMILES: CCCOC(Cc1ccc(OCCc2nc(oc2C)-c2ccccc2)c2ccccc12)C(O)=O
InChI Key: InChIKey=DVIBSRAWYQNSOH-UHFFFAOYSA-N
Data: 2 IC50  2 EC50
Activity Spreadsheet -- Enzyme Inhibition Constant Data from BindingDB
Found 4 hits for monomerid = 50277861
Trg + Lig
Ki
nM
ΔG°
kcal/mole
IC50
nM
Kd
nM
EC50/IC50
nM
koff
s-1
kon
M-1s-1
pHTemp
°C
Peroxisome proliferator-activated receptor alpha (PPAR alpha)
(Homo sapiens (Human))
BDBM50277861
(3-(4-(2-(5-methyl-2-phenyloxazol-4-yl)ethoxy)napht...)
Show SMILES CCCOC(Cc1ccc(OCCc2nc(oc2C)-c2ccccc2)c2ccccc12)C(O)=O
Show InChI InChI=1S/C28H29NO5/c1-3-16-32-26(28(30)31)18-21-13-14-25(23-12-8-7-11-22(21)23)33-17-15-24-19(2)34-27(29-24)20-9-5-4-6-10-20/h4-14,26H,3,15-18H2,1-2H3,(H,30,31)
n/an/a 69n/an/an/an/an/an/a
F. Hoffmann-La Roche Ltd
Curated by ChEMBL
Assay Description
Displacement of radio labeled 2(S)-(2-benzoyl-phenylamino)-3-{4-[1,1-ditritio-2-(5-methyl-2-phenyl-oxazol-4-yl)-ethoxy]-phenyl}-propionic acid from G...
Bioorg Med Chem Lett 19: 2468-73 (2009)
Article DOI: 10.1016/j.bmcl.2009.03.036
BindingDB Entry DOI: 10.7270/Q2QC03C3
Peroxisome proliferator-activated receptor
(Homo sapiens (Human))
BDBM50277861
(3-(4-(2-(5-methyl-2-phenyloxazol-4-yl)ethoxy)napht...)
Show SMILES CCCOC(Cc1ccc(OCCc2nc(oc2C)-c2ccccc2)c2ccccc12)C(O)=O
Show InChI InChI=1S/C28H29NO5/c1-3-16-32-26(28(30)31)18-21-13-14-25(23-12-8-7-11-22(21)23)33-17-15-24-19(2)34-27(29-24)20-9-5-4-6-10-20/h4-14,26H,3,15-18H2,1-2H3,(H,30,31)
NCI pathway
Reactome pathway
n/an/an/an/a 16n/an/an/an/a
F. Hoffmann-La Roche Ltd
Curated by ChEMBL
Assay Description
Agonist activity at human PPARgamma expressed in BHK21 cells assessed as SEAP activity by luciferase reporter transactivation assay
Bioorg Med Chem Lett 19: 2468-73 (2009)
Article DOI: 10.1016/j.bmcl.2009.03.036
BindingDB Entry DOI: 10.7270/Q2QC03C3
Peroxisome proliferator-activated receptor alpha (PPAR alpha)
(Homo sapiens (Human))
BDBM50277861
(3-(4-(2-(5-methyl-2-phenyloxazol-4-yl)ethoxy)napht...)
Show SMILES CCCOC(Cc1ccc(OCCc2nc(oc2C)-c2ccccc2)c2ccccc12)C(O)=O
Show InChI InChI=1S/C28H29NO5/c1-3-16-32-26(28(30)31)18-21-13-14-25(23-12-8-7-11-22(21)23)33-17-15-24-19(2)34-27(29-24)20-9-5-4-6-10-20/h4-14,26H,3,15-18H2,1-2H3,(H,30,31)
n/an/an/an/a 87n/an/an/an/a
F. Hoffmann-La Roche Ltd
Curated by ChEMBL
Assay Description
Agonist activity at human PPARalpha by luciferase reporter transactivation assay
Bioorg Med Chem Lett 19: 2468-73 (2009)
Article DOI: 10.1016/j.bmcl.2009.03.036
BindingDB Entry DOI: 10.7270/Q2QC03C3
Peroxisome proliferator-activated receptor
(Homo sapiens (Human))
BDBM50277861
(3-(4-(2-(5-methyl-2-phenyloxazol-4-yl)ethoxy)napht...)
Show SMILES CCCOC(Cc1ccc(OCCc2nc(oc2C)-c2ccccc2)c2ccccc12)C(O)=O
Show InChI InChI=1S/C28H29NO5/c1-3-16-32-26(28(30)31)18-21-13-14-25(23-12-8-7-11-22(21)23)33-17-15-24-19(2)34-27(29-24)20-9-5-4-6-10-20/h4-14,26H,3,15-18H2,1-2H3,(H,30,31)
NCI pathway
Reactome pathway
n/an/a 7n/an/an/an/an/an/a
F. Hoffmann-La Roche Ltd
Curated by ChEMBL
Assay Description
Displacement of radio labeled 2(S)-(2-benzoyl-phenylamino)-3-{4-[1,1-ditritio-2-(5-methyl-2-phenyl-oxazol-4-yl)-ethoxy]-phenyl}-propionic acid from G...
Bioorg Med Chem Lett 19: 2468-73 (2009)
Article DOI: 10.1016/j.bmcl.2009.03.036
BindingDB Entry DOI: 10.7270/Q2QC03C3