null
SMILES: CCc1ccccc1Oc1ccc(C#N)c(c1)C(F)(F)F
InChI Key: InChIKey=BUQGJALCBYKRRC-UHFFFAOYSA-N
Activity Spreadsheet -- Enzyme Inhibition Constant Data from BindingDB
Found 2 hits for monomerid = 50278353
Trg + Lig
Ki
nM
ΔG°
kcal/mole
IC50
nM
Kd
nM
EC50/IC50
nM
koff
s-1
kon
M-1s-1
pHTemp
°C
Androgen receptor
(Homo sapiens (Human))
BDBM50278353
(4-(2-ethylphenoxy)-2-(trifluoromethyl)benzonitrile...)
Show SMILES CCc1ccccc1Oc1ccc(C#N)c(c1)C(F)(F)F
Show InChI InChI=1S/C16H12F3NO/c1-2-11-5-3-4-6-15(11)21-13-8-7-12(10-20)14(9-13)16(17,18)19/h3-9H,2H2,1H3
NCI pathway
Reactome pathway
n/an/a 20n/an/an/an/an/an/a
Pfizer Global Research and Development
Curated by ChEMBL
Assay Description
Displacement of [3H]DHT from human cloned androgen receptor expressed in insect Sf9 cell system
Bioorg Med Chem Lett 19: 2176-8 (2009)
Article DOI: 10.1016/j.bmcl.2009.02.104
BindingDB Entry DOI: 10.7270/Q27P8Z8W
Androgen receptor
(Homo sapiens (Human))
BDBM50278353
(4-(2-ethylphenoxy)-2-(trifluoromethyl)benzonitrile...)
Show SMILES CCc1ccccc1Oc1ccc(C#N)c(c1)C(F)(F)F
Show InChI InChI=1S/C16H12F3NO/c1-2-11-5-3-4-6-15(11)21-13-8-7-12(10-20)14(9-13)16(17,18)19/h3-9H,2H2,1H3
NCI pathway
Reactome pathway
n/an/a 356n/an/an/an/an/an/a
Pfizer Global Research and Development
Curated by ChEMBL
Assay Description
Antagonist activity at human androgen receptor expressed in human MDA-MB-231 cells assessed as inhibition of DHT-induced response
Bioorg Med Chem Lett 19: 2176-8 (2009)
Article DOI: 10.1016/j.bmcl.2009.02.104
BindingDB Entry DOI: 10.7270/Q27P8Z8W