BDBM50293452 1-methyl-1-(3-(7-oxo-7H-dibenzo[de,g]quinoline-4-carboxamido)propyl)piperidinium iodide::CHEMBL563713
SMILES: C[N+]1(CCCNC(=O)c2cnc3C(=O)c4ccccc4-c4cccc2c34)CCCCC1
InChI Key: InChIKey=PLXASKOPCYOAAZ-UHFFFAOYSA-O
Data: 1 KI  2 IC50
Activity Spreadsheet -- Enzyme Inhibition Constant Data from BindingDB
Found 3 hits for monomerid = 50293452
Trg + Lig
Ki
nM
ΔG°
kcal/mole
IC50
nM
Kd
nM
EC50/IC50
nM
koff
s-1
kon
M-1s-1
pHTemp
°C
Acetylcholinesterase
(Electrophorus electricus (Electric eel))
BDBM50293452
(1-methyl-1-(3-(7-oxo-7H-dibenzo[de,g]quinoline-4-c...)
Show SMILES C[N+]1(CCCNC(=O)c2cnc3C(=O)c4ccccc4-c4cccc2c34)CCCCC1
Show InChI InChI=1S/C26H27N3O2/c1-29(14-5-2-6-15-29)16-8-13-27-26(31)22-17-28-24-23-19(11-7-12-20(22)23)18-9-3-4-10-21(18)25(24)30/h3-4,7,9-12,17H,2,5-6,8,13-16H2,1H3/p+1
110n/an/an/an/an/an/an/an/a
Sun Yat-sen University
Curated by ChEMBL
Assay Description
Inhibition of electric eel AChE by LB plot
Eur J Med Chem 44: 2523-32 (2009)
Article DOI: 10.1016/j.ejmech.2009.01.021
BindingDB Entry DOI: 10.7270/Q2Z89CFV
Acetylcholinesterase
(Electrophorus electricus (Electric eel))
BDBM50293452
(1-methyl-1-(3-(7-oxo-7H-dibenzo[de,g]quinoline-4-c...)
Show SMILES C[N+]1(CCCNC(=O)c2cnc3C(=O)c4ccccc4-c4cccc2c34)CCCCC1
Show InChI InChI=1S/C26H27N3O2/c1-29(14-5-2-6-15-29)16-8-13-27-26(31)22-17-28-24-23-19(11-7-12-20(22)23)18-9-3-4-10-21(18)25(24)30/h3-4,7,9-12,17H,2,5-6,8,13-16H2,1H3/p+1
n/an/a 110n/an/an/an/an/an/a
Sun Yat-sen University
Curated by ChEMBL
Assay Description
Inhibition of electric eel AChE by Ellman's method
Eur J Med Chem 44: 2523-32 (2009)
Article DOI: 10.1016/j.ejmech.2009.01.021
BindingDB Entry DOI: 10.7270/Q2Z89CFV
Butyrylcholinesterase (BuChE)
(Equus caballus (Horse))
BDBM50293452
(1-methyl-1-(3-(7-oxo-7H-dibenzo[de,g]quinoline-4-c...)
Show SMILES C[N+]1(CCCNC(=O)c2cnc3C(=O)c4ccccc4-c4cccc2c34)CCCCC1
Show InChI InChI=1S/C26H27N3O2/c1-29(14-5-2-6-15-29)16-8-13-27-26(31)22-17-28-24-23-19(11-7-12-20(22)23)18-9-3-4-10-21(18)25(24)30/h3-4,7,9-12,17H,2,5-6,8,13-16H2,1H3/p+1
n/an/a 6.24E+3n/an/an/an/an/an/a
Sun Yat-sen University
Curated by ChEMBL
Assay Description
Inhibition of equine serum BuChE by Ellman's method
Eur J Med Chem 44: 2523-32 (2009)
Article DOI: 10.1016/j.ejmech.2009.01.021
BindingDB Entry DOI: 10.7270/Q2Z89CFV