null
SMILES: [#6]\[#6](-[#6])=[#6]\[#6]-[#7]-[#6](-[#7])=[#7]-[#6]-[#6]-[#6]-[#6]-[#6]-[#6]-[#7]
InChI Key: InChIKey=MMAWEAPOXJEGLK-UHFFFAOYSA-N
Activity Spreadsheet -- Enzyme Inhibition Constant Data from BindingDB
Found 1 hit for monomerid = 50294113
Trg + Lig
Ki
nM
ΔG°
kcal/mole
IC50
nM
Kd
nM
EC50/IC50
nM
koff
s-1
kon
M-1s-1
pHTemp
°C
Polyamine oxidase 1
(Zea mays)
BDBM50294113
(1-(6-aminohexyl)-3-(3-methylbut-2-enyl)guanidine |...)
Show SMILES [#6]\[#6](-[#6])=[#6]\[#6]-[#7]-[#6](-[#7])=[#7]-[#6]-[#6]-[#6]-[#6]-[#6]-[#6]-[#7] |w:8.8|
Show InChI InChI=1S/C12H26N4/c1-11(2)7-10-16-12(14)15-9-6-4-3-5-8-13/h7H,3-6,8-10,13H2,1-2H3,(H3,14,15,16)
22n/an/an/an/an/an/a6.5n/a
Universit£ degli Studi di Siena
Curated by ChEMBL
Assay Description
Inhibition of maize PAO at pH 6.5 by spectrophotometry-based Dixon plot method
J Med Chem 52: 4774-85 (2009)
Article DOI: 10.1021/jm900371z
BindingDB Entry DOI: 10.7270/Q2TB16W1
3D
3D Structure (docked)