BDBM50297400 (S)-4-Cyano-N-[3-(4-fluorophenyl)-3-(4-methanesulfonyl-phenyl)-propyl]-benzamide::4-cyano-N-{(3S)-3-(4-fluorophenyl)-3-[4-(methylsulfonyl)phenyl]propyl}benzamide::CHEMBL556717
SMILES: CS(=O)(=O)c1ccc(cc1)[C@@H](CCNC(=O)c1ccc(cc1)C#N)c1ccc(F)cc1
InChI Key: InChIKey=OXJGQTIVCHEXQS-QHCPKHFHSA-N
Data: 7 IC50  2 EC50
PDB links: 1 PDB ID matches this monomer.
Activity Spreadsheet -- Enzyme Inhibition Constant Data from BindingDB
Found 9 hits for monomerid = 50297400
Trg + Lig
Ki
nM
ΔG°
kcal/mole
IC50
nM
Kd
nM
EC50/IC50
nM
koff
s-1
kon
M-1s-1
pHTemp
°C
EBifunctional epoxide hydrolase 2
(Homo sapiens (Human))
BDBM50297400
((S)-4-Cyano-N-[3-(4-fluorophenyl)-3-(4-methanesulf...)
Show SMILES CS(=O)(=O)c1ccc(cc1)[C@@H](CCNC(=O)c1ccc(cc1)C#N)c1ccc(F)cc1 |r|
Show InChI InChI=1S/C24H21FN2O3S/c1-31(29,30)22-12-8-19(9-13-22)23(18-6-10-21(25)11-7-18)14-15-27-24(28)20-4-2-17(16-26)3-5-20/h2-13,23H,14-15H2,1H3,(H,27,28)/t23-/m0/s1
n/an/a 8n/an/an/an/an/an/a
Boehringer Ingelheim Pharmaceuticals
Curated by ChEMBL
Assay Description
Displacement of rhodamine-labeled probe from human soluble epoxide hydrolase by fluorescence polarization assay
J Med Chem 52: 5880-95 (2009)
Article DOI: 10.1021/jm9005302
BindingDB Entry DOI: 10.7270/Q2BG2P2G
3D
3D Structure (crystal)
Epoxide hydrolase 2
(Rattus norvegicus)
BDBM50297400
((S)-4-Cyano-N-[3-(4-fluorophenyl)-3-(4-methanesulf...)
Show SMILES CS(=O)(=O)c1ccc(cc1)[C@@H](CCNC(=O)c1ccc(cc1)C#N)c1ccc(F)cc1 |r|
Show InChI InChI=1S/C24H21FN2O3S/c1-31(29,30)22-12-8-19(9-13-22)23(18-6-10-21(25)11-7-18)14-15-27-24(28)20-4-2-17(16-26)3-5-20/h2-13,23H,14-15H2,1H3,(H,27,28)/t23-/m0/s1
n/an/a 9n/an/an/an/an/an/a
Boehringer Ingelheim Pharmaceuticals
Curated by ChEMBL
Assay Description
Displacement of rhodamine-labeled probe from rat soluble epoxide hydrolase by fluorescence polarization assay
J Med Chem 52: 5880-95 (2009)
Article DOI: 10.1021/jm9005302
BindingDB Entry DOI: 10.7270/Q2BG2P2G
Cytochrome P450 2C9
(Homo sapiens (Human))
BDBM50297400
((S)-4-Cyano-N-[3-(4-fluorophenyl)-3-(4-methanesulf...)
Show SMILES CS(=O)(=O)c1ccc(cc1)[C@@H](CCNC(=O)c1ccc(cc1)C#N)c1ccc(F)cc1 |r|
Show InChI InChI=1S/C24H21FN2O3S/c1-31(29,30)22-12-8-19(9-13-22)23(18-6-10-21(25)11-7-18)14-15-27-24(28)20-4-2-17(16-26)3-5-20/h2-13,23H,14-15H2,1H3,(H,27,28)/t23-/m0/s1
Reactome pathway
n/an/a 7.00E+3n/an/an/an/an/an/a
Boehringer Ingelheim Pharmaceuticals
Curated by ChEMBL
Assay Description
Inhibition of CYP2C9
J Med Chem 52: 5880-95 (2009)
Article DOI: 10.1021/jm9005302
BindingDB Entry DOI: 10.7270/Q2BG2P2G
Cytochrome P450 2C19
(Homo sapiens (Human))
BDBM50297400
((S)-4-Cyano-N-[3-(4-fluorophenyl)-3-(4-methanesulf...)
Show SMILES CS(=O)(=O)c1ccc(cc1)[C@@H](CCNC(=O)c1ccc(cc1)C#N)c1ccc(F)cc1 |r|
Show InChI InChI=1S/C24H21FN2O3S/c1-31(29,30)22-12-8-19(9-13-22)23(18-6-10-21(25)11-7-18)14-15-27-24(28)20-4-2-17(16-26)3-5-20/h2-13,23H,14-15H2,1H3,(H,27,28)/t23-/m0/s1
Reactome pathway
n/an/a 1.10E+4n/an/an/an/an/an/a
Boehringer Ingelheim Pharmaceuticals
Curated by ChEMBL
Assay Description
Inhibition of CYP2C19
J Med Chem 52: 5880-95 (2009)
Article DOI: 10.1021/jm9005302
BindingDB Entry DOI: 10.7270/Q2BG2P2G
Epoxide hydrolase 2
(Rattus norvegicus)
BDBM50297400
((S)-4-Cyano-N-[3-(4-fluorophenyl)-3-(4-methanesulf...)
Show SMILES CS(=O)(=O)c1ccc(cc1)[C@@H](CCNC(=O)c1ccc(cc1)C#N)c1ccc(F)cc1 |r|
Show InChI InChI=1S/C24H21FN2O3S/c1-31(29,30)22-12-8-19(9-13-22)23(18-6-10-21(25)11-7-18)14-15-27-24(28)20-4-2-17(16-26)3-5-20/h2-13,23H,14-15H2,1H3,(H,27,28)/t23-/m0/s1
n/an/a 6n/an/an/an/an/an/a
Boehringer Ingelheim Pharmaceuticals
Curated by ChEMBL
Assay Description
Displacement of rhodamine-labeled probe from rat soluble epoxide hydrolase by fluorescence polarization assay
J Med Chem 52: 5880-95 (2009)
Article DOI: 10.1021/jm9005302
BindingDB Entry DOI: 10.7270/Q2BG2P2G
EBifunctional epoxide hydrolase 2
(Homo sapiens (Human))
BDBM50297400
((S)-4-Cyano-N-[3-(4-fluorophenyl)-3-(4-methanesulf...)
Show SMILES CS(=O)(=O)c1ccc(cc1)[C@@H](CCNC(=O)c1ccc(cc1)C#N)c1ccc(F)cc1 |r|
Show InChI InChI=1S/C24H21FN2O3S/c1-31(29,30)22-12-8-19(9-13-22)23(18-6-10-21(25)11-7-18)14-15-27-24(28)20-4-2-17(16-26)3-5-20/h2-13,23H,14-15H2,1H3,(H,27,28)/t23-/m0/s1
n/an/an/an/a 0.140n/an/an/an/a
Boehringer Ingelheim Pharmaceuticals
Curated by ChEMBL
Assay Description
Inhibition of human soluble epoxide hydrolase in human HepG cells assessed as conversion of epoxyeicosatienoic acid to dihydroxyeicosatrienoic acid a...
J Med Chem 52: 5880-95 (2009)
Article DOI: 10.1021/jm9005302
BindingDB Entry DOI: 10.7270/Q2BG2P2G
3D
3D Structure (crystal)
EBifunctional epoxide hydrolase 2
(Homo sapiens (Human))
BDBM50297400
((S)-4-Cyano-N-[3-(4-fluorophenyl)-3-(4-methanesulf...)
Show SMILES CS(=O)(=O)c1ccc(cc1)[C@@H](CCNC(=O)c1ccc(cc1)C#N)c1ccc(F)cc1 |r|
Show InChI InChI=1S/C24H21FN2O3S/c1-31(29,30)22-12-8-19(9-13-22)23(18-6-10-21(25)11-7-18)14-15-27-24(28)20-4-2-17(16-26)3-5-20/h2-13,23H,14-15H2,1H3,(H,27,28)/t23-/m0/s1
n/an/an/an/a 0.300n/an/an/an/a
Boehringer Ingelheim Pharmaceuticals
Curated by ChEMBL
Assay Description
Inhibition of human soluble epoxide hydrolase in human HepG cells assessed as conversion of epoxyeicosatienoic acid to dihydroxyeicosatrienoic acid a...
J Med Chem 52: 5880-95 (2009)
Article DOI: 10.1021/jm9005302
BindingDB Entry DOI: 10.7270/Q2BG2P2G
3D
3D Structure (crystal)
EBifunctional epoxide hydrolase 2
(Homo sapiens (Human))
BDBM50297400
((S)-4-Cyano-N-[3-(4-fluorophenyl)-3-(4-methanesulf...)
Show SMILES CS(=O)(=O)c1ccc(cc1)[C@@H](CCNC(=O)c1ccc(cc1)C#N)c1ccc(F)cc1 |r|
Show InChI InChI=1S/C24H21FN2O3S/c1-31(29,30)22-12-8-19(9-13-22)23(18-6-10-21(25)11-7-18)14-15-27-24(28)20-4-2-17(16-26)3-5-20/h2-13,23H,14-15H2,1H3,(H,27,28)/t23-/m0/s1
n/an/a 6n/an/an/an/an/an/a
Boehringer Ingelheim Pharmaceuticals
Curated by ChEMBL
Assay Description
Displacement of rhodamine-labeled probe from human soluble epoxide hydrolase by fluorescence polarization assay
J Med Chem 52: 5880-95 (2009)
Article DOI: 10.1021/jm9005302
BindingDB Entry DOI: 10.7270/Q2BG2P2G
3D
3D Structure (crystal)
Cytochrome P450 2J2
(Homo sapiens (Human))
BDBM50297400
((S)-4-Cyano-N-[3-(4-fluorophenyl)-3-(4-methanesulf...)
Show SMILES CS(=O)(=O)c1ccc(cc1)[C@@H](CCNC(=O)c1ccc(cc1)C#N)c1ccc(F)cc1 |r|
Show InChI InChI=1S/C24H21FN2O3S/c1-31(29,30)22-12-8-19(9-13-22)23(18-6-10-21(25)11-7-18)14-15-27-24(28)20-4-2-17(16-26)3-5-20/h2-13,23H,14-15H2,1H3,(H,27,28)/t23-/m0/s1
n/an/a 3.00E+3n/an/an/an/an/an/a
Boehringer Ingelheim Pharmaceuticals
Curated by ChEMBL
Assay Description
Inhibition of CYP2J2
J Med Chem 52: 5880-95 (2009)
Article DOI: 10.1021/jm9005302
BindingDB Entry DOI: 10.7270/Q2BG2P2G