null
SMILES: CCN1CCN(C1=O)c1ccc2n(cnc2c1)-c1ccnc(N[C@@H](C)[C@@H]2CN(CCN2C)C(=O)Nc2cccc3ccccc23)n1
InChI Key: InChIKey=WAKMBOPGTZEJIO-JHOBJCJYSA-N
Activity Spreadsheet -- Enzyme Inhibition Constant Data from BindingDB
Found 1 hit for monomerid = 50301618
Trg + Lig
Ki
nM
ΔG°
kcal/mole
IC50
nM
Kd
nM
EC50/IC50
nM
koff
s-1
kon
M-1s-1
pHTemp
°C
Tyrosine-protein kinase Lck
(Homo sapiens (Human))
BDBM50301618
((S)-3-((S)-1-(4-(5-(3-ethyl-2-oxoimidazolidin-1-yl...)
Show SMILES CCN1CCN(C1=O)c1ccc2n(cnc2c1)-c1ccnc(N[C@@H](C)[C@@H]2CN(CCN2C)C(=O)Nc2cccc3ccccc23)n1 |r|
Show InChI InChI=1S/C34H38N10O2/c1-4-41-18-19-43(34(41)46)25-12-13-29-28(20-25)36-22-44(29)31-14-15-35-32(39-31)37-23(2)30-21-42(17-16-40(30)3)33(45)38-27-11-7-9-24-8-5-6-10-26(24)27/h5-15,20,22-23,30H,4,16-19,21H2,1-3H3,(H,38,45)(H,35,37,39)/t23-,30-/m0/s1
n/an/a 0.400n/an/an/an/an/an/a
Merck Research Laboratories
Curated by ChEMBL
Assay Description
Inhibition of Lck
Bioorg Med Chem Lett 19: 5440-3 (2009)
Article DOI: 10.1016/j.bmcl.2009.07.102
BindingDB Entry DOI: 10.7270/Q2GX4BM0