BDBM50302368 CHEMBL567291::N-(1-(4'-(3-propoxyphenoxy)biphenyl-4-yl)ethyl)acetamide
SMILES: CCCOc1cccc(Oc2ccc(cc2)-c2ccc(cc2)C(C)NC(C)=O)c1
InChI Key: InChIKey=QRXPINIRDJNWFK-UHFFFAOYSA-N
Data: 2 IC50
Activity Spreadsheet -- Enzyme Inhibition Constant Data from BindingDB
Found 2 hits for monomerid = 50302368
Trg + Lig
Ki
nM
ΔG°
kcal/mole
IC50
nM
Kd
nM
EC50/IC50
nM
koff
s-1
kon
M-1s-1
pHTemp
°C
Acetyl-CoA carboxylase 2 (ACC2)
(Homo sapiens (Human))
BDBM50302368
(CHEMBL567291 | N-(1-(4'-(3-propoxyphenoxy)biphenyl...)
Show SMILES CCCOc1cccc(Oc2ccc(cc2)-c2ccc(cc2)C(C)NC(C)=O)c1
Show InChI InChI=1S/C25H27NO3/c1-4-16-28-24-6-5-7-25(17-24)29-23-14-12-22(13-15-23)21-10-8-20(9-11-21)18(2)26-19(3)27/h5-15,17-18H,4,16H2,1-3H3,(H,26,27)
Reactome pathway
n/an/a 12n/an/an/an/an/an/a
Bristol-Myers Squibb Research and Development
Curated by ChEMBL
Assay Description
Inhibition of human recombinant ACC 2 expressed in baculovirus expression system by FAS-coupled assay
Bioorg Med Chem Lett 19: 5872-6 (2009)
Article DOI: 10.1016/j.bmcl.2009.08.077
BindingDB Entry DOI: 10.7270/Q24J0F6F
Acetyl-CoA carboxylase 1 (ACC1)
(Homo sapiens (Human))
BDBM50302368
(CHEMBL567291 | N-(1-(4'-(3-propoxyphenoxy)biphenyl...)
Show SMILES CCCOc1cccc(Oc2ccc(cc2)-c2ccc(cc2)C(C)NC(C)=O)c1
Show InChI InChI=1S/C25H27NO3/c1-4-16-28-24-6-5-7-25(17-24)29-23-14-12-22(13-15-23)21-10-8-20(9-11-21)18(2)26-19(3)27/h5-15,17-18H,4,16H2,1-3H3,(H,26,27)
n/an/a 13n/an/an/an/an/an/a
Bristol-Myers Squibb Research and Development
Curated by ChEMBL
Assay Description
Inhibition of human recombinant ACC 1 expressed in baculovirus expression system by FAS-coupled assay
Bioorg Med Chem Lett 19: 5872-6 (2009)
Article DOI: 10.1016/j.bmcl.2009.08.077
BindingDB Entry DOI: 10.7270/Q24J0F6F