BDBM50303526 (1-Pentyl-1H-indol-3-yl)(2,2,3,3-tetramethylcyclopropyl)methanone::CHEMBL571773
SMILES: CCCCCn1cc(C(=O)C2C(C)(C)C2(C)C)c2ccccc12
InChI Key: InChIKey=NBMMIBNZVQFQEO-UHFFFAOYSA-N
Data: 2 KI  2 EC50
Activity Spreadsheet -- Enzyme Inhibition Constant Data from BindingDB
Found 4 hits for monomerid = 50303526
Trg + Lig
Ki
nM
ΔG°
kcal/mole
IC50
nM
Kd
nM
EC50/IC50
nM
koff
s-1
kon
M-1s-1
pHTemp
°C
Cannabinoid receptor 2
(Homo sapiens (Human))
BDBM50303526
((1-Pentyl-1H-indol-3-yl)(2,2,3,3-tetramethylcyclop...)
Show SMILES CCCCCn1cc(C(=O)C2C(C)(C)C2(C)C)c2ccccc12
Show InChI InChI=1S/C21H29NO/c1-6-7-10-13-22-14-16(15-11-8-9-12-17(15)22)18(23)19-20(2,3)21(19,4)5/h8-9,11-12,14,19H,6-7,10,13H2,1-5H3
Reactome pathway
1.80n/an/an/an/an/an/an/an/a
Abbott Laboratories
Curated by ChEMBL
Assay Description
Displacement of [3H]CP-55940 from human recombinant CB2 receptor expressed in HEK293 cells
J Med Chem 53: 295-315 (2010)
Article DOI: 10.1021/jm901214q
BindingDB Entry DOI: 10.7270/Q2KD1Z00
Cannabinoid receptor 1
(Homo sapiens (Human))
BDBM50303526
((1-Pentyl-1H-indol-3-yl)(2,2,3,3-tetramethylcyclop...)
Show SMILES CCCCCn1cc(C(=O)C2C(C)(C)C2(C)C)c2ccccc12
Show InChI InChI=1S/C21H29NO/c1-6-7-10-13-22-14-16(15-11-8-9-12-17(15)22)18(23)19-20(2,3)21(19,4)5/h8-9,11-12,14,19H,6-7,10,13H2,1-5H3
NCI pathway
Reactome pathway
150n/an/an/an/an/an/an/an/a
Abbott Laboratories
Curated by ChEMBL
Assay Description
Displacement of [3H]CP-55940 from human recombinant CB1 receptor expressed in CHO cells
J Med Chem 53: 295-315 (2010)
Article DOI: 10.1021/jm901214q
BindingDB Entry DOI: 10.7270/Q2KD1Z00
Cannabinoid receptor
(MOUSE)
BDBM50303526
((1-Pentyl-1H-indol-3-yl)(2,2,3,3-tetramethylcyclop...)
Show SMILES CCCCCn1cc(C(=O)C2C(C)(C)C2(C)C)c2ccccc12
Show InChI InChI=1S/C21H29NO/c1-6-7-10-13-22-14-16(15-11-8-9-12-17(15)22)18(23)19-20(2,3)21(19,4)5/h8-9,11-12,14,19H,6-7,10,13H2,1-5H3
Reactome pathway
n/an/an/an/a 95n/an/an/an/a
ShanghaiTech University
Curated by ChEMBL
Assay Description
Inverse agonist activity at C-terminally prolink-tagged mouse CB2 receptor expressed in CHOK1 cells harboring beta-galactosidase enzyme fused beta-ar...
J Med Chem 61: 9841-9878 (2018)
Article DOI: 10.1021/acs.jmedchem.8b00435
Cannabinoid receptor 2
(Homo sapiens (Human))
BDBM50303526
((1-Pentyl-1H-indol-3-yl)(2,2,3,3-tetramethylcyclop...)
Show SMILES CCCCCn1cc(C(=O)C2C(C)(C)C2(C)C)c2ccccc12
Show InChI InChI=1S/C21H29NO/c1-6-7-10-13-22-14-16(15-11-8-9-12-17(15)22)18(23)19-20(2,3)21(19,4)5/h8-9,11-12,14,19H,6-7,10,13H2,1-5H3
Reactome pathway
n/an/an/an/a 29n/an/an/an/a
Abbott Laboratories
Curated by ChEMBL
Assay Description
Agonist activity at human recombinant CB2 receptor expressed in HEK293 cells coexpressing Galphaq/o5 assessed as calcium mobilization by FLIPR assay
J Med Chem 53: 295-315 (2010)
Article DOI: 10.1021/jm901214q
BindingDB Entry DOI: 10.7270/Q2KD1Z00