null
SMILES: Cc1cc2c(ncnc2o1)N1CCNCC1
InChI Key: InChIKey=MNCCXFCOQHVIEX-UHFFFAOYSA-N
Activity Spreadsheet -- Enzyme Inhibition Constant Data from BindingDB
Found 2 hits for monomerid = 50304811
Trg + Lig
Ki
nM
ΔG°
kcal/mole
IC50
nM
Kd
nM
EC50/IC50
nM
koff
s-1
kon
M-1s-1
pHTemp
°C
5-hydroxytryptamine receptor 2C
(Homo sapiens (Human))
BDBM50304811
(6-methyl-4-(piperazin-1-yl)furo[2,3-d]pyrimidine |...)
Show SMILES Cc1cc2c(ncnc2o1)N1CCNCC1
Show InChI InChI=1S/C11H14N4O/c1-8-6-9-10(13-7-14-11(9)16-8)15-4-2-12-3-5-15/h6-7,12H,2-5H2,1H3
Reactome pathway
156n/an/an/an/an/an/an/an/a
Pfizer Global Research and Development
Curated by ChEMBL
Assay Description
Agonist activity against human 5HT2C receptor by FLIPR assay relative to 5HT
Bioorg Med Chem Lett 20: 266-71 (2010)
Article DOI: 10.1016/j.bmcl.2009.10.112
BindingDB Entry DOI: 10.7270/Q2154H5M
5-hydroxytryptamine receptor 2C
(Homo sapiens (Human))
BDBM50304811
(6-methyl-4-(piperazin-1-yl)furo[2,3-d]pyrimidine |...)
Show SMILES Cc1cc2c(ncnc2o1)N1CCNCC1
Show InChI InChI=1S/C11H14N4O/c1-8-6-9-10(13-7-14-11(9)16-8)15-4-2-12-3-5-15/h6-7,12H,2-5H2,1H3
Reactome pathway
n/an/an/an/a 660n/an/an/an/a
Pfizer Global Research and Development
Curated by ChEMBL
Assay Description
Agonist activity against human 5HT2C receptor by FLIPR assay
Bioorg Med Chem Lett 20: 266-71 (2010)
Article DOI: 10.1016/j.bmcl.2009.10.112
BindingDB Entry DOI: 10.7270/Q2154H5M