BDBM50304996 CHEMBL590110::N4-(7-(benzofuran-2-yl)-1H-indazol-5-yl)pyrimidine-2,4-diamine::N~4~-[7-(1-benzofuran-2-yl)-1H-indazol-5-yl]pyrimidine-2,4-diamine
SMILES: Nc1nccc(Nc2cc(-c3cc4ccccc4o3)c3[nH]ncc3c2)n1
InChI Key: InChIKey=IQDDLNJTLVXFQA-UHFFFAOYSA-N
Data: 1 IC50
PDB links: 1 PDB ID matches this monomer.
Activity Spreadsheet -- Enzyme Inhibition Constant Data from BindingDB
Found 1 hit for monomerid = 50304996
Trg + Lig
Ki
nM
ΔG°
kcal/mole
IC50
nM
Kd
nM
EC50/IC50
nM
koff
s-1
kon
M-1s-1
pHTemp
°C
MAP kinase-activated protein kinase 2
(Homo sapiens (Human))
BDBM50304996
(CHEMBL590110 | N4-(7-(benzofuran-2-yl)-1H-indazol-...)
Show SMILES Nc1nccc(Nc2cc(-c3cc4ccccc4o3)c3[nH]ncc3c2)n1
Show InChI InChI=1S/C19H14N6O/c20-19-21-6-5-17(24-19)23-13-7-12-10-22-25-18(12)14(9-13)16-8-11-3-1-2-4-15(11)26-16/h1-10H,(H,22,25)(H3,20,21,23,24)
NCI pathway
Reactome pathway
n/an/a 1.30E+3n/an/an/an/an/an/a
Abbott Laboratories
Curated by ChEMBL
Assay Description
Inhibition of MK2
Bioorg Med Chem Lett 20: 334-7 (2010)
Article DOI: 10.1016/j.bmcl.2009.10.103
BindingDB Entry DOI: 10.7270/Q2VD6ZJJ
3D
3D Structure (crystal)