null
SMILES: Cc1n[nH]c2ccc(cc12)-c1cc(OC[C@@H](N)Cc2ccccc2)cnc1-c1ccc[nH]1
InChI Key: InChIKey=AXVBNZXUWYSIES-FQEVSTJZSA-N
Activity Spreadsheet -- Enzyme Inhibition Constant Data from BindingDB
Found 2 hits for monomerid = 50306100
Trg + Lig
Ki
nM
ΔG°
kcal/mole
IC50
nM
Kd
nM
EC50/IC50
nM
koff
s-1
kon
M-1s-1
pHTemp
°C
RAC-alpha serine/threonine-protein kinase
(Homo sapiens (Human))
BDBM50306100
((S)-1-(5-(3-methyl-1H-indazol-5-yl)-6-(1H-pyrrol-2...)
Show SMILES Cc1n[nH]c2ccc(cc12)-c1cc(OC[C@@H](N)Cc2ccccc2)cnc1-c1ccc[nH]1 |r|
Show InChI InChI=1S/C26H25N5O/c1-17-22-13-19(9-10-24(22)31-30-17)23-14-21(15-29-26(23)25-8-5-11-28-25)32-16-20(27)12-18-6-3-2-4-7-18/h2-11,13-15,20,28H,12,16,27H2,1H3,(H,30,31)/t20-/m0/s1
n/an/a 15n/an/an/an/an/an/a
GlaxoSmithKline
Curated by ChEMBL
Assay Description
Inhibition of full length AKT1
Bioorg Med Chem Lett 20: 673-8 (2010)
Article DOI: 10.1016/j.bmcl.2009.11.064
BindingDB Entry DOI: 10.7270/Q2D21XQ0
Rho-associated protein kinase 1
(Homo sapiens (Human))
BDBM50306100
((S)-1-(5-(3-methyl-1H-indazol-5-yl)-6-(1H-pyrrol-2...)
Show SMILES Cc1n[nH]c2ccc(cc12)-c1cc(OC[C@@H](N)Cc2ccccc2)cnc1-c1ccc[nH]1 |r|
Show InChI InChI=1S/C26H25N5O/c1-17-22-13-19(9-10-24(22)31-30-17)23-14-21(15-29-26(23)25-8-5-11-28-25)32-16-20(27)12-18-6-3-2-4-7-18/h2-11,13-15,20,28H,12,16,27H2,1H3,(H,30,31)/t20-/m0/s1
NCI pathway
Reactome pathway
n/an/a>1.00E+4n/an/an/an/an/an/a
GlaxoSmithKline
Curated by ChEMBL
Assay Description
Inhibition of ROCK1
Bioorg Med Chem Lett 20: 673-8 (2010)
Article DOI: 10.1016/j.bmcl.2009.11.064
BindingDB Entry DOI: 10.7270/Q2D21XQ0