BDBM50306215 4-(2-amino-2-iminoethyl)-1-(2-chlorophenyl)-5-(4-chlorophenyl)-N-(piperidin-1-yl)-1H-pyrazole-3-carboxamide::CHEMBL596164
SMILES: NC(=N)Cc1c(nn(c1-c1ccc(Cl)cc1)-c1ccccc1Cl)C(=O)NN1CCCCC1
InChI Key: InChIKey=NTBCKEBLAKIMOW-UHFFFAOYSA-N
Data: 2 IC50
Activity Spreadsheet -- Enzyme Inhibition Constant Data from BindingDB
Found 2 hits for monomerid = 50306215
Trg + Lig
Ki
nM
ΔG°
kcal/mole
IC50
nM
Kd
nM
EC50/IC50
nM
koff
s-1
kon
M-1s-1
pHTemp
°C
Cannabinoid receptor 1
(Homo sapiens (Human))
BDBM50306215
(4-(2-amino-2-iminoethyl)-1-(2-chlorophenyl)-5-(4-c...)
Show SMILES NC(=N)Cc1c(nn(c1-c1ccc(Cl)cc1)-c1ccccc1Cl)C(=O)NN1CCCCC1
Show InChI InChI=1S/C23H24Cl2N6O/c24-16-10-8-15(9-11-16)22-17(14-20(26)27)21(23(32)29-30-12-4-1-5-13-30)28-31(22)19-7-3-2-6-18(19)25/h2-3,6-11H,1,4-5,12-14H2,(H3,26,27)(H,29,32)
NCI pathway
Reactome pathway
n/an/a 0.930n/an/an/an/an/an/a
7TM Pharma A/S
Curated by ChEMBL
Assay Description
Antagonist activity at human CB1 receptor expressed in CHO-K1 cells assessed as inhibition of CP55940-induced GTPgammaS binding
Bioorg Med Chem Lett 20: 453-7 (2010)
Article DOI: 10.1016/j.bmcl.2009.12.003
BindingDB Entry DOI: 10.7270/Q2MK6D09
Cannabinoid receptor 1
(Homo sapiens (Human))
BDBM50306215
(4-(2-amino-2-iminoethyl)-1-(2-chlorophenyl)-5-(4-c...)
Show SMILES NC(=N)Cc1c(nn(c1-c1ccc(Cl)cc1)-c1ccccc1Cl)C(=O)NN1CCCCC1
Show InChI InChI=1S/C23H24Cl2N6O/c24-16-10-8-15(9-11-16)22-17(14-20(26)27)21(23(32)29-30-12-4-1-5-13-30)28-31(22)19-7-3-2-6-18(19)25/h2-3,6-11H,1,4-5,12-14H2,(H3,26,27)(H,29,32)
NCI pathway
Reactome pathway
n/an/a 0.400n/an/an/an/an/an/a
7TM Pharma A/S
Curated by ChEMBL
Assay Description
Inverse agonist activity at human CB1 receptor expressed in CHO-K1 cells by GTPgammaS binding assay
Bioorg Med Chem Lett 20: 453-7 (2010)
Article DOI: 10.1016/j.bmcl.2009.12.003
BindingDB Entry DOI: 10.7270/Q2MK6D09