BDBM50306248 1-(2-(4-bromophenyl)acetyl)-2,3,9,9a-tetrahydro-1H-benzo[de][1,7]naphthyridin-7(8H)-one::CHEMBL594521
SMILES: Brc1ccc(CC(=O)N2CCc3cccc4C(=O)NCC2c34)cc1
InChI Key: InChIKey=PVEJMVVRBFYQAK-UHFFFAOYSA-N
Data: 1 IC50  1 EC50
Activity Spreadsheet -- Enzyme Inhibition Constant Data from BindingDB
Found 2 hits for monomerid = 50306248
Trg + Lig
Ki
nM
ΔG°
kcal/mole
IC50
nM
Kd
nM
EC50/IC50
nM
koff
s-1
kon
M-1s-1
pHTemp
°C
Poly [ADP-ribose] polymerase 1
(Homo sapiens (Human))
BDBM50306248
(1-(2-(4-bromophenyl)acetyl)-2,3,9,9a-tetrahydro-1H...)
Show SMILES Brc1ccc(CC(=O)N2CCc3cccc4C(=O)NCC2c34)cc1
Show InChI InChI=1S/C19H17BrN2O2/c20-14-6-4-12(5-7-14)10-17(23)22-9-8-13-2-1-3-15-18(13)16(22)11-21-19(15)24/h1-7,16H,8-11H2,(H,21,24)
n/an/a 7n/an/an/an/an/an/a
IRBM-Merck Research Laboratories Rome
Curated by ChEMBL
Assay Description
Inhibition of human PARP1 by scintillation proximity assay
Bioorg Med Chem Lett 20: 448-52 (2010)
Article DOI: 10.1016/j.bmcl.2009.12.002
BindingDB Entry DOI: 10.7270/Q2GT5N91
Poly [ADP-ribose] polymerase 1
(Homo sapiens (Human))
BDBM50306248
(1-(2-(4-bromophenyl)acetyl)-2,3,9,9a-tetrahydro-1H...)
Show SMILES Brc1ccc(CC(=O)N2CCc3cccc4C(=O)NCC2c34)cc1
Show InChI InChI=1S/C19H17BrN2O2/c20-14-6-4-12(5-7-14)10-17(23)22-9-8-13-2-1-3-15-18(13)16(22)11-21-19(15)24/h1-7,16H,8-11H2,(H,21,24)
n/an/an/an/a 200n/an/an/an/a
IRBM-Merck Research Laboratories Rome
Curated by ChEMBL
Assay Description
Inhibition of PARP1 in human HeLa cells assessed as inhibition of hydrogen peroxide-induced poly(ADP-ribosyl)ation
Bioorg Med Chem Lett 20: 448-52 (2010)
Article DOI: 10.1016/j.bmcl.2009.12.002
BindingDB Entry DOI: 10.7270/Q2GT5N91